Golestan Cohort Study (GCS)
type: Ontology
version IRI: gcs.owl
description: The data dictionary of items collected by the GCS.

definition
type: AnnotationProperty

alternative term
type: AnnotationProperty

source
type: AnnotationProperty

database_cross_reference
type: AnnotationProperty

comment
type: AnnotationProperty

see also
type: AnnotationProperty

answer type
type: AnnotationProperty

formula
type: AnnotationProperty

internal ID
type: AnnotationProperty

measurement time
type: AnnotationProperty

number of cohorts
type: AnnotationProperty

question description
type: AnnotationProperty

use cases requirements
type: AnnotationProperty

value
type: AnnotationProperty

is about
type: ObjectProperty

has target
type: ObjectProperty

measurement of
type: ObjectProperty

output of
type: ObjectProperty

Identity
type: Class
definition: Identity and contact information
database_cross_reference: GECKO:0000052
internal ID: ID

survey administration
type: Axiom
annotated source: Identity
annotated property: database_cross_reference
annotated target: GECKO:0000052

Demographic Info
type: Class
definition: Demographic characteristics: sex, age, ethnicity, marital status, education
database_cross_reference: GECKO:0000009
internal ID: DEMO

demographic data
type: Axiom
annotated source: Demographic Info
annotated property: database_cross_reference
annotated target: GECKO:0000009

Family members
type: Class
definition: Characteristics of relatives in the household
database_cross_reference: GECKO:0000066
internal ID: FAM

family and household structure
type: Axiom
annotated source: Family members
annotated property: database_cross_reference
annotated target: GECKO:0000066

Residence
type: Class
definition: The residential area (urban/rural), structure of the house, and duration of residing in the house
database_cross_reference: GECKO:0000064
internal ID: RESID

residence
type: Axiom
annotated source: Residence
annotated property: database_cross_reference
annotated target: GECKO:0000064

Water and fuel source
type: Class
definition: Water source, heat and fuel system, and cooking method
database_cross_reference: PATO:0001995
internal ID: SOURCE

socio-demographic and economic characteristics
type: Axiom
annotated source: Water and fuel source
annotated property: database_cross_reference
annotated target: PATO:0001995

Job
type: Class
definition: The names of all jobs the participant has had and the duration of work
database_cross_reference: PATO:0001995
internal ID: JOB

socio-demographic and economic characteristics
type: Axiom
annotated source: Job
annotated property: database_cross_reference
annotated target: PATO:0001995

Food preservation and cooking
type: Class
definition: Food preservation, frying, boiling, BBQ, steaming, ‚Ä¶
database_cross_reference: PATO:0001995
internal ID: FOOD

socio-demographic and economic characteristics
type: Axiom
annotated source: Food preservation and cooking
annotated property: database_cross_reference
annotated target: PATO:0001995

Properties
type: Class
definition: Transferable and non-transferable belongings and wealth score (Multiple Correspondence Analysis)
database_cross_reference: PATO:0001995
internal ID: PROP

socio-demographic and economic characteristics
type: Axiom
annotated source: Properties
annotated property: database_cross_reference
annotated target: PATO:0001995

Medical History
type: Class
definition: Suffering from any disease at the baseline of cohort
database_cross_reference: MONDO:0000001
internal ID: MED

diseases
type: Axiom
annotated source: Medical History
annotated property: database_cross_reference
annotated target: MONDO:0000001

Chief complaints
type: Class
definition: The complaints of participants from their physical or mental sufferings
database_cross_reference: OGMS:0000020
internal ID: CC

signs and symptoms
type: Axiom
annotated source: Chief complaints
annotated property: database_cross_reference
annotated target: OGMS:0000020

Cancer History
type: Class
definition: History of cancer, site, and age diagnosed in the participant or any of his/her relatives
database_cross_reference: MONDO:0004992
internal ID: CANCER

cancer
type: Axiom
annotated source: Cancer History
annotated property: database_cross_reference
annotated target: MONDO:0004992

Smoking
type: Class
definition: Ever or current smoker, age of use, type, number per day and days per week
database_cross_reference: GECKO:0000068
internal ID: SMOK

tobacco use history
type: Axiom
annotated source: Smoking
annotated property: database_cross_reference
annotated target: GECKO:0000068

Opium use
type: Class
definition: Ever or current user, age and route of use, type, time per day and days per week
database_cross_reference: GECKO:0000103
internal ID: OPIUM

recreational drug history
type: Axiom
annotated source: Opium use
annotated property: database_cross_reference
annotated target: GECKO:0000103

Alcohol use
type: Class
definition: Ever or current user, age of use, type, quantity per episode and episodes per month
database_cross_reference: GECKO:0000069
internal ID: ALC

alcohol use history
type: Axiom
annotated source: Alcohol use
annotated property: database_cross_reference
annotated target: GECKO:0000069

Drug history (1)
type: Class
definition: The main created categories of drugs consumed by participants
database_cross_reference: GECKO:0000093
internal ID: DRUGCAT

medication
type: Axiom
annotated source: Drug history (1)
annotated property: database_cross_reference
annotated target: GECKO:0000093

Drug History (2)
type: Class
definition: The exact name, duration, dose, and frequency of drugs consumed
database_cross_reference: GECKO:0000093
internal ID: DRUGDETAIL

medication
type: Axiom
annotated source: Drug History (2)
annotated property: database_cross_reference
annotated target: GECKO:0000093

Oral health
type: Class
definition: Decayed, filled, and missing teeth along with the age of the participant in each of these occasions
internal ID: ORAL

Tea
type: Class
definition: Tea temperature, type of tea, and type of habit for drinking the tea
database_cross_reference: PATO:0001995
internal ID: TEA

socio-demographic and economic characteristics
type: Axiom
annotated source: Tea
annotated property: database_cross_reference
annotated target: PATO:0001995

Physical activity
type: Class
definition: The duration and intensity of physical activities during working and leasure times of the day, and Metabolic Equivalent Task (MET)
database_cross_reference: GECKO:0000104
internal ID: ACTIVITY

physical activity history
type: Axiom
annotated source: Physical activity
annotated property: database_cross_reference
annotated target: GECKO:0000104

Animal contact
type: Class
definition: The age of the participant in contact with animals, the duration and intensity of animal contact, and the type of animal
database_cross_reference: PATO:0001995
internal ID: ANIMAL

socio-demographic and economic characteristics
type: Axiom
annotated source: Animal contact
annotated property: database_cross_reference
annotated target: PATO:0001995

Anthropometric measurements
type: Class
definition: Physically measured height, weight, waist circumference, hip circumference and data of pictogram
database_cross_reference: CMO:0000021
internal ID: ANTHRO

anthropometry
type: Axiom
annotated source: Anthropometric measurements
annotated property: database_cross_reference
annotated target: CMO:0000021

Blood pressure measurements
type: Class
definition: Both systolic and diastolic blood pressure measured in sitting position twice from each arm
database_cross_reference: CMO:0000003
internal ID: BP

blood pressure
type: Axiom
annotated source: Blood pressure measurements
annotated property: database_cross_reference
annotated target: CMO:0000003

Food Frequency Questionnaire
type: Class
definition: Units of food categories consumed per day
database_cross_reference: GECKO:0000072
internal ID: FFQ

dietary history
type: Axiom
annotated source: Food Frequency Questionnaire
annotated property: database_cross_reference
annotated target: GECKO:0000072

Lab markers
type: Class
definition: Biochemical markers
database_cross_reference: GECKO:0000027
internal ID: LAB

laboratory measures
type: Axiom
annotated source: Lab markers
annotated property: database_cross_reference
annotated target: GECKO:0000027

PID
type: Class
subclass of: Identity
definition: The Unique Id for eatch participant
database_cross_reference: GECKO:0000055
internal ID: PID

unique identifiers
type: Axiom
annotated source: PID
annotated property: database_cross_reference
annotated target: GECKO:0000055

FirstName
type: Class
subclass of: Identity
definition: The first name of participant.
database_cross_reference: GECKO:0000052
internal ID: FirstName

survey administration
type: Axiom
annotated source: FirstName
annotated property: database_cross_reference
annotated target: GECKO:0000052

LastName
type: Class
subclass of: Identity
definition: The last name of participant.
database_cross_reference: GECKO:0000052
internal ID: LastName

survey administration
type: Axiom
annotated source: LastName
annotated property: database_cross_reference
annotated target: GECKO:0000052

Province
type: Class
subclass of: Identity
definition: Specifies the participant Province of Residence
database_cross_reference: GECKO:0000064
internal ID: Province

residence
type: Axiom
annotated source: Province
annotated property: database_cross_reference
annotated target: GECKO:0000064

District
type: Class
subclass of: Identity
definition: Specifies the participant District of Residence
database_cross_reference: GECKO:0000064
internal ID: District

residence
type: Axiom
annotated source: District
annotated property: database_cross_reference
annotated target: GECKO:0000064

City
type: Class
subclass of: Identity
definition: Specifies the participant City of Residence
database_cross_reference: GECKO:0000064
internal ID: City

residence
type: Axiom
annotated source: City
annotated property: database_cross_reference
annotated target: GECKO:0000064

Subdistrict
type: Class
subclass of: Identity
definition: Specifies the participant Subdistrict of Residence
database_cross_reference: GECKO:0000064
internal ID: Subdistrict

residence
type: Axiom
annotated source: Subdistrict
annotated property: database_cross_reference
annotated target: GECKO:0000064

Village
type: Class
subclass of: Identity
definition: Specifies the participant Village of Residence
database_cross_reference: GECKO:0000064
internal ID: Village

residence
type: Axiom
annotated source: Village
annotated property: database_cross_reference
annotated target: GECKO:0000064

Street
type: Class
subclass of: Identity
definition: Specifies the participant Street of Residence
database_cross_reference: GECKO:0000064
internal ID: Street

residence
type: Axiom
annotated source: Street
annotated property: database_cross_reference
annotated target: GECKO:0000064

Alley
type: Class
subclass of: Identity
definition: Specifies the participant Alley of Residence
database_cross_reference: GECKO:0000064
internal ID: Alley

residence
type: Axiom
annotated source: Alley
annotated property: database_cross_reference
annotated target: GECKO:0000064

CV name
type: Class
subclass of: Identity
definition: Specifies the names of cities or villages in one variable
database_cross_reference: GECKO:0000064
internal ID: CV_name

residence
type: Axiom
annotated source: CV name
annotated property: database_cross_reference
annotated target: GECKO:0000064

City_Village
type: Class
subclass of: Identity
definition: Specifies residence in cities or villages
database_cross_reference: GECKO:0000064
internal ID: City_Village

residence
type: Axiom
annotated source: City_Village
annotated property: database_cross_reference
annotated target: GECKO:0000064

HouseNumber
type: Class
subclass of: Identity
definition: Specifies the participant's House Number of Residence
database_cross_reference: GECKO:0000064
internal ID: HouseNumber

residence
type: Axiom
annotated source: HouseNumber
annotated property: database_cross_reference
annotated target: GECKO:0000064

ZipCode
type: Class
subclass of: Identity
definition: Specifies the participant's Zip Code of Residence
database_cross_reference: GECKO:0000064
internal ID: ZipCode

residence
type: Axiom
annotated source: ZipCode
annotated property: database_cross_reference
annotated target: GECKO:0000064

HomePhone
type: Class
subclass of: Identity
definition: Specifies the participants Home Phone
database_cross_reference: GECKO:0000052
internal ID: HomePhone

survey administration
type: Axiom
annotated source: HomePhone
annotated property: database_cross_reference
annotated target: GECKO:0000052

AreaCode
type: Class
subclass of: Identity
definition: Specifies the participant's home Phone Area Code
database_cross_reference: GECKO:0000052
internal ID: AreaCode

survey administration
type: Axiom
annotated source: AreaCode
annotated property: database_cross_reference
annotated target: GECKO:0000052

CellPhone
type: Class
subclass of: Identity
definition: Specifies the participant's Cell phone number
database_cross_reference: GECKO:0000052
internal ID: CellPhone

survey administration
type: Axiom
annotated source: CellPhone
annotated property: database_cross_reference
annotated target: GECKO:0000052

HealthCenter
type: Class
subclass of: Identity
definition: participant related to this health center(the participant covered by this health center)
database_cross_reference: GECKO:0000073
internal ID: HealthCenter

physician/practitioner info
type: Axiom
annotated source: HealthCenter
annotated property: database_cross_reference
annotated target: GECKO:0000073

FamilyMemPhone
type: Class
subclass of: Identity
definition: Specifies the phone number of one of participant's family members
database_cross_reference: GECKO:0000052
internal ID: FamilyMemPhone

survey administration
type: Axiom
annotated source: FamilyMemPhone
annotated property: database_cross_reference
annotated target: GECKO:0000052

FamilyMemAreaCode
type: Class
subclass of: Identity
definition: Specifies the area code of the phone number of one of participant's family members
database_cross_reference: GECKO:0000052
internal ID: FamilyMemAreaCode

survey administration
type: Axiom
annotated source: FamilyMemAreaCode
annotated property: database_cross_reference
annotated target: GECKO:0000052

FamilyMemName
type: Class
subclass of: Identity
definition: Specifies the name of one family member of the participant
database_cross_reference: GECKO:0000052
internal ID: FamilyMemName

survey administration
type: Axiom
annotated source: FamilyMemName
annotated property: database_cross_reference
annotated target: GECKO:0000052

FriendName
type: Class
subclass of: Identity
definition: Specifies the name of one of friends of the participant
database_cross_reference: GECKO:0000052
internal ID: FriendName

survey administration
type: Axiom
annotated source: FriendName
annotated property: database_cross_reference
annotated target: GECKO:0000052

FriendProvince
type: Class
subclass of: Identity
definition: Specifies the province in which the friend of the participant resides
database_cross_reference: GECKO:0000052
internal ID: FriendProvince

survey administration
type: Axiom
annotated source: FriendProvince
annotated property: database_cross_reference
annotated target: GECKO:0000052

FriendDistrict
type: Class
subclass of: Identity
definition: Specifies the district in which the friend of the participant resides
database_cross_reference: GECKO:0000052
internal ID: FriendDistrict

survey administration
type: Axiom
annotated source: FriendDistrict
annotated property: database_cross_reference
annotated target: GECKO:0000052

FriendCity
type: Class
subclass of: Identity
definition: Specifies the city in which the friend of the participant resides
database_cross_reference: GECKO:0000052
internal ID: FriendCity

survey administration
type: Axiom
annotated source: FriendCity
annotated property: database_cross_reference
annotated target: GECKO:0000052

FriendSubdistrict
type: Class
subclass of: Identity
definition: Specifies the subdistrict in which the friend of the participant resides
database_cross_reference: GECKO:0000052
internal ID: FriendSubdistrict

survey administration
type: Axiom
annotated source: FriendSubdistrict
annotated property: database_cross_reference
annotated target: GECKO:0000052

FriendVillage
type: Class
subclass of: Identity
definition: Specifies the village in which the friend of the participant resides
database_cross_reference: GECKO:0000052
internal ID: FriendVillage

survey administration
type: Axiom
annotated source: FriendVillage
annotated property: database_cross_reference
annotated target: GECKO:0000052

FriendStreet
type: Class
subclass of: Identity
definition: Specifies the street in which the friend of the participant resides
database_cross_reference: GECKO:0000052
internal ID: FriendStreet

survey administration
type: Axiom
annotated source: FriendStreet
annotated property: database_cross_reference
annotated target: GECKO:0000052

FriendAlley
type: Class
subclass of: Identity
definition: Specifies the alley in which the friend of the participant resides
database_cross_reference: GECKO:0000052
internal ID: FriendAlley

survey administration
type: Axiom
annotated source: FriendAlley
annotated property: database_cross_reference
annotated target: GECKO:0000052

FriendHouseNumber
type: Class
subclass of: Identity
definition: Specifies the house number in which the friend of the participant resides
database_cross_reference: GECKO:0000052
internal ID: FriendHouseNumber

survey administration
type: Axiom
annotated source: FriendHouseNumber
annotated property: database_cross_reference
annotated target: GECKO:0000052

FriendZipCode
type: Class
subclass of: Identity
definition: Specifies the zip code in which the friend of the participant resides
database_cross_reference: GECKO:0000052
internal ID: FriendZipCode

survey administration
type: Axiom
annotated source: FriendZipCode
annotated property: database_cross_reference
annotated target: GECKO:0000052

FriendHomePhone
type: Class
subclass of: Identity
definition: Specifies the phone number of the participant's friend
database_cross_reference: GECKO:0000052
internal ID: FriendHomePhone

survey administration
type: Axiom
annotated source: FriendHomePhone
annotated property: database_cross_reference
annotated target: GECKO:0000052

FriendAreaCode
type: Class
subclass of: Identity
definition: Specifies the area code of the phone number of participant's friend
database_cross_reference: GECKO:0000052
internal ID: FriendAreaCode

survey administration
type: Axiom
annotated source: FriendAreaCode
annotated property: database_cross_reference
annotated target: GECKO:0000052

FriendCellPhone
type: Class
subclass of: Identity
definition: Specifies the cell phone number of participant's friend
database_cross_reference: GECKO:0000052
internal ID: FriendCellPhone

survey administration
type: Axiom
annotated source: FriendCellPhone
annotated property: database_cross_reference
annotated target: GECKO:0000052

PlaceOfInterview
type: Class
subclass of: Demographic Info
definition: Specifies the participant interview place
database_cross_reference: GECKO:0000006
internal ID: PlaceOfInterview

location
type: Axiom
annotated source: PlaceOfInterview
annotated property: database_cross_reference
annotated target: GECKO:0000006

InterviewPDate_Y
type: Class
subclass of: Demographic Info
definition: participant year of Interview date in Shamsi format
database_cross_reference: STATO:0000093
internal ID: InterviewPDate_Y

date and time-related information
type: Axiom
annotated source: InterviewPDate_Y
annotated property: database_cross_reference
annotated target: STATO:0000093

InterviewPDate_M
type: Class
subclass of: Demographic Info
definition: participant month of Interview date in Shamsi format
database_cross_reference: STATO:0000093
internal ID: InterviewPDate_M

date and time-related information
type: Axiom
annotated source: InterviewPDate_M
annotated property: database_cross_reference
annotated target: STATO:0000093

InterviewPDate_D
type: Class
subclass of: Demographic Info
definition: participant Day of Interview date in Shamsi format
database_cross_reference: STATO:0000093
internal ID: InterviewPDate_D

date and time-related information
type: Axiom
annotated source: InterviewPDate_D
annotated property: database_cross_reference
annotated target: STATO:0000093

Gender
type: Class
subclass of: Demographic Info
definition: Specifies the participant Gender
database_cross_reference: GECKO:0000060
internal ID: Gender

gender
type: Axiom
annotated source: Gender
annotated property: database_cross_reference
annotated target: GECKO:0000060

BdatePDate_Y
type: Class
subclass of: Demographic Info
definition: Year of participant Birth date in Shamsi format
database_cross_reference: PATO:0000011
internal ID: BdatePDate_Y

age/birthdate
type: Axiom
annotated source: BdatePDate_Y
annotated property: database_cross_reference
annotated target: PATO:0000011

BdatePDate_M
type: Class
subclass of: Demographic Info
definition: Month of participant Birth date in Shamsi format
database_cross_reference: PATO:0000011
internal ID: BdatePDate_M

age/birthdate
type: Axiom
annotated source: BdatePDate_M
annotated property: database_cross_reference
annotated target: PATO:0000011

BdatePDate_D
type: Class
subclass of: Demographic Info
definition: Day of participant Birth date in Shamsi format
database_cross_reference: PATO:0000011
internal ID: BdatePDate_D

age/birthdate
type: Axiom
annotated source: BdatePDate_D
annotated property: database_cross_reference
annotated target: PATO:0000011

Age_self
type: Class
subclass of: Demographic Info
definition: Specifies the self-report participant age in inteview time
database_cross_reference: PATO:0000011
internal ID: Age_self

age/birthdate
type: Axiom
annotated source: Age_self
annotated property: database_cross_reference
annotated target: PATO:0000011

Age_new
type: Class
subclass of: Demographic Info
definition: Age calculated from birth date and interview date
database_cross_reference: PATO:0000011
internal ID: Age_new

age/birthdate
type: Axiom
annotated source: Age_new
annotated property: database_cross_reference
annotated target: PATO:0000011

Ethnicity
type: Class
subclass of: Demographic Info
definition: Specifies the participant Ethnicity
database_cross_reference: GECKO:0000061
internal ID: Ethnicity

ethnicity/race
type: Axiom
annotated source: Ethnicity
annotated property: database_cross_reference
annotated target: GECKO:0000061

ethnicity_new
type: Class
subclass of: Demographic Info
definition: Specifies ethnicity by Turkmen or Non-turkmen
database_cross_reference: GECKO:0000061
internal ID: ethnicity_new

ethnicity/race
type: Axiom
annotated source: ethnicity_new
annotated property: database_cross_reference
annotated target: GECKO:0000061

MaritalStatus
type: Class
subclass of: Demographic Info
definition: Specifies the participant marital status
database_cross_reference: PATO:0001995
internal ID: MaritalStatus

socio-demographic and economic characteristics
type: Axiom
annotated source: MaritalStatus
annotated property: database_cross_reference
annotated target: PATO:0001995

marital_new
type: Class
subclass of: Demographic Info
definition: Specifies marital status into married or non-married
database_cross_reference: PATO:0001995
internal ID: marital_new

socio-demographic and economic characteristics
type: Axiom
annotated source: marital_new
annotated property: database_cross_reference
annotated target: PATO:0001995

Education
type: Class
subclass of: Demographic Info
definition: Specifies the participant Education Level
database_cross_reference: GECKO:0000065
internal ID: Education

education
type: Axiom
annotated source: Education
annotated property: database_cross_reference
annotated target: GECKO:0000065

FamilyInHousehold
type: Class
subclass of: Family members
definition: Specifies the number of participant family living in the household
database_cross_reference: GECKO:0000066
internal ID: FamilyInHousehold

family and household structure
type: Axiom
annotated source: FamilyInHousehold
annotated property: database_cross_reference
annotated target: GECKO:0000066

BrothersN
type: Class
subclass of: Family members
definition: Specifies participant No. of Brothers
database_cross_reference: GECKO:0000066
internal ID: BrothersN

family and household structure
type: Axiom
annotated source: BrothersN
annotated property: database_cross_reference
annotated target: GECKO:0000066

StepbrothersN
type: Class
subclass of: Family members
definition: Specifies participant No. of Step brothers
database_cross_reference: GECKO:0000066
internal ID: StepbrothersN

family and household structure
type: Axiom
annotated source: StepbrothersN
annotated property: database_cross_reference
annotated target: GECKO:0000066

SistersN
type: Class
subclass of: Family members
definition: Specifies participant No. of Sisters
database_cross_reference: GECKO:0000066
internal ID: SistersN

family and household structure
type: Axiom
annotated source: SistersN
annotated property: database_cross_reference
annotated target: GECKO:0000066

Stepsisters
type: Class
subclass of: Family members
definition: Specifies participant No. of Step sisters
database_cross_reference: GECKO:0000066
internal ID: Stepsisters

family and household structure
type: Axiom
annotated source: Stepsisters
annotated property: database_cross_reference
annotated target: GECKO:0000066

Sons
type: Class
subclass of: Family members
definition: Specifies participant No. of Sons
database_cross_reference: GECKO:0000066
internal ID: Sons

family and household structure
type: Axiom
annotated source: Sons
annotated property: database_cross_reference
annotated target: GECKO:0000066

Daughters
type: Class
subclass of: Family members
definition: Specifies participant No. of Daughters
database_cross_reference: GECKO:0000066
internal ID: Daughters

family and household structure
type: Axiom
annotated source: Daughters
annotated property: database_cross_reference
annotated target: GECKO:0000066

TwinYesNo
type: Class
subclass of: Family members
definition: Specifies whether the participant has twin brother or sister
database_cross_reference: GECKO:0000066
internal ID: TwinYesNo

family and household structure
type: Axiom
annotated source: TwinYesNo
annotated property: database_cross_reference
annotated target: GECKO:0000066

TwinAlive
type: Class
subclass of: Family members
definition: Specifies whether the twin of the participant is alive
database_cross_reference: GECKO:0000066
internal ID: TwinAlive

family and household structure
type: Axiom
annotated source: TwinAlive
annotated property: database_cross_reference
annotated target: GECKO:0000066

ResDuration_1
type: Class
subclass of: Residence
definition: Specifies the participant first residence history Duration
database_cross_reference: GECKO:0000064
internal ID: ResDuration_1

residence
type: Axiom
annotated source: ResDuration_1
annotated property: database_cross_reference
annotated target: GECKO:0000064

ResCitVill_1
type: Class
subclass of: Residence
definition: Specifies the participant first residence history in Village or City
database_cross_reference: GECKO:0000064
internal ID: ResCitVill_1

residence
type: Axiom
annotated source: ResCitVill_1
annotated property: database_cross_reference
annotated target: GECKO:0000064

ResDistrict_1
type: Class
subclass of: Residence
definition: Specifies the participant first residence history District
database_cross_reference: GECKO:0000064
internal ID: ResDistrict_1

residence
type: Axiom
annotated source: ResDistrict_1
annotated property: database_cross_reference
annotated target: GECKO:0000064

ResCitVillname_1
type: Class
subclass of: Residence
definition: Specifies the participant first residence history City or village name
database_cross_reference: GECKO:0000064
internal ID: ResCitVillname_1

residence
type: Axiom
annotated source: ResCitVillname_1
annotated property: database_cross_reference
annotated target: GECKO:0000064

ResHouseType_1
type: Class
subclass of: Residence
definition: Specifies the participant first residence history House Type
database_cross_reference: GECKO:0000064
internal ID: ResHouseType_1

residence
type: Axiom
annotated source: ResHouseType_1
annotated property: database_cross_reference
annotated target: GECKO:0000064

ResDuration_2
type: Class
subclass of: Residence
definition: Specifies the participant second residence history Duration
database_cross_reference: GECKO:0000064
internal ID: ResDuration_2

residence
type: Axiom
annotated source: ResDuration_2
annotated property: database_cross_reference
annotated target: GECKO:0000064

ResCitVill_2
type: Class
subclass of: Residence
definition: Specifies the participant second residence history in Village or City
database_cross_reference: GECKO:0000064
internal ID: ResCitVill_2

residence
type: Axiom
annotated source: ResCitVill_2
annotated property: database_cross_reference
annotated target: GECKO:0000064

ResDistrict_2
type: Class
subclass of: Residence
definition: Specifies the participant second residence history District
database_cross_reference: GECKO:0000064
internal ID: ResDistrict_2

residence
type: Axiom
annotated source: ResDistrict_2
annotated property: database_cross_reference
annotated target: GECKO:0000064

ResCitVillname_2
type: Class
subclass of: Residence
definition: Specifies the participant second residence history City or village name
database_cross_reference: GECKO:0000064
internal ID: ResCitVillname_2

residence
type: Axiom
annotated source: ResCitVillname_2
annotated property: database_cross_reference
annotated target: GECKO:0000064

ResHouseType_2
type: Class
subclass of: Residence
definition: Specifies the participant second residence history House Type
database_cross_reference: GECKO:0000064
internal ID: ResHouseType_2

residence
type: Axiom
annotated source: ResHouseType_2
annotated property: database_cross_reference
annotated target: GECKO:0000064

ResDuration_3
type: Class
subclass of: Residence
definition: Specifies the participant third residence history Duration
database_cross_reference: GECKO:0000064
internal ID: ResDuration_3

residence
type: Axiom
annotated source: ResDuration_3
annotated property: database_cross_reference
annotated target: GECKO:0000064

ResCitVill_3
type: Class
subclass of: Residence
definition: Specifies the participant third residence history in Village or City
database_cross_reference: GECKO:0000064
internal ID: ResCitVill_3

residence
type: Axiom
annotated source: ResCitVill_3
annotated property: database_cross_reference
annotated target: GECKO:0000064

ResDistrict_3
type: Class
subclass of: Residence
definition: Specifies the participant third residence history District
database_cross_reference: GECKO:0000064
internal ID: ResDistrict_3

residence
type: Axiom
annotated source: ResDistrict_3
annotated property: database_cross_reference
annotated target: GECKO:0000064

ResCitVillname_3
type: Class
subclass of: Residence
definition: Specifies the participant third residence history City or village name
database_cross_reference: GECKO:0000064
internal ID: ResCitVillname_3

residence
type: Axiom
annotated source: ResCitVillname_3
annotated property: database_cross_reference
annotated target: GECKO:0000064

ResHouseType_3
type: Class
subclass of: Residence
definition: Specifies the participant third residence history House Type
database_cross_reference: GECKO:0000064
internal ID: ResHouseType_3

residence
type: Axiom
annotated source: ResHouseType_3
annotated property: database_cross_reference
annotated target: GECKO:0000064

FoodWatSource
type: Class
subclass of: Water and fuel source
definition: Specifies participant used water source
database_cross_reference: PATO:0001995
internal ID: FoodWatSource

socio-demographic and economic characteristics
type: Axiom
annotated source: FoodWatSource
annotated property: database_cross_reference
annotated target: PATO:0001995

FoodWatYearsPipe
type: Class
subclass of: Water and fuel source
definition: Specifies how many years participant used pipe water
database_cross_reference: PATO:0001995
internal ID: FoodWatYearsPipe

socio-demographic and economic characteristics
type: Axiom
annotated source: FoodWatYearsPipe
annotated property: database_cross_reference
annotated target: PATO:0001995

FoodWatPriorPipeSource
type: Class
subclass of: Water and fuel source
definition: Specifies what water source participant used prior to pipe water
database_cross_reference: PATO:0001995
internal ID: FoodWatPriorPipeSource

socio-demographic and economic characteristics
type: Axiom
annotated source: FoodWatPriorPipeSource
annotated property: database_cross_reference
annotated target: PATO:0001995

HeatAndFuelDuration_1
type: Class
subclass of: Water and fuel source
definition: Specifies the duration the participant Used Heating or Fuel system, first history
database_cross_reference: PATO:0001995
internal ID: HeatAndFuelDuration_1

socio-demographic and economic characteristics
type: Axiom
annotated source: HeatAndFuelDuration_1
annotated property: database_cross_reference
annotated target: PATO:0001995

HeatingSystemType_1
type: Class
subclass of: Water and fuel source
definition: Specifies the participant Used Heating Type, first history
database_cross_reference: PATO:0001995
internal ID: HeatingSystemType_1

socio-demographic and economic characteristics
type: Axiom
annotated source: HeatingSystemType_1
annotated property: database_cross_reference
annotated target: PATO:0001995

HeatMethod_1
type: Class
subclass of: Water and fuel source
definition: Specifies the participant Used Heating Type of fuel, first history
database_cross_reference: PATO:0001995
internal ID: HeatMethod_1

socio-demographic and economic characteristics
type: Axiom
annotated source: HeatMethod_1
annotated property: database_cross_reference
annotated target: PATO:0001995

CookingMethod_1
type: Class
subclass of: Water and fuel source
definition: Specifies the participant Used Cooking Type of fuel, first history
database_cross_reference: PATO:0001995
internal ID: CookingMethod_1

socio-demographic and economic characteristics
type: Axiom
annotated source: CookingMethod_1
annotated property: database_cross_reference
annotated target: PATO:0001995

HeatAndFuelDuration_2
type: Class
subclass of: Water and fuel source
definition: Specifies the duration the participant Used Heating or Fuel system, second history
database_cross_reference: PATO:0001995
internal ID: HeatAndFuelDuration_2

socio-demographic and economic characteristics
type: Axiom
annotated source: HeatAndFuelDuration_2
annotated property: database_cross_reference
annotated target: PATO:0001995

HeatingSystemType_2
type: Class
subclass of: Water and fuel source
definition: Specifies the participant Used Heating Type, second history
database_cross_reference: PATO:0001995
internal ID: HeatingSystemType_2

socio-demographic and economic characteristics
type: Axiom
annotated source: HeatingSystemType_2
annotated property: database_cross_reference
annotated target: PATO:0001995

HeatMethod_2
type: Class
subclass of: Water and fuel source
definition: Specifies the participant Used Heating Type of fuel, second history
database_cross_reference: PATO:0001995
internal ID: HeatMethod_2

socio-demographic and economic characteristics
type: Axiom
annotated source: HeatMethod_2
annotated property: database_cross_reference
annotated target: PATO:0001995

CookingMethod_2
type: Class
subclass of: Water and fuel source
definition: Specifies the participant Used Cooking Type of fuel, second history
database_cross_reference: PATO:0001995
internal ID: CookingMethod_2

socio-demographic and economic characteristics
type: Axiom
annotated source: CookingMethod_2
annotated property: database_cross_reference
annotated target: PATO:0001995

HeatAndFuelDuration_3
type: Class
subclass of: Water and fuel source
definition: Specifies the duration participant Used Heating or Fuel system, third history
database_cross_reference: PATO:0001995
internal ID: HeatAndFuelDuration_3

socio-demographic and economic characteristics
type: Axiom
annotated source: HeatAndFuelDuration_3
annotated property: database_cross_reference
annotated target: PATO:0001995

HeatingSystemType_3
type: Class
subclass of: Water and fuel source
definition: Specifies the participant Used Heating Type, third history
database_cross_reference: PATO:0001995
internal ID: HeatingSystemType_3

socio-demographic and economic characteristics
type: Axiom
annotated source: HeatingSystemType_3
annotated property: database_cross_reference
annotated target: PATO:0001995

HeatMethod_3
type: Class
subclass of: Water and fuel source
definition: Specifies the participant Used Heating Type of fuel, third history
database_cross_reference: PATO:0001995
internal ID: HeatMethod_3

socio-demographic and economic characteristics
type: Axiom
annotated source: HeatMethod_3
annotated property: database_cross_reference
annotated target: PATO:0001995

CookingMethod_3
type: Class
subclass of: Water and fuel source
definition: Specifies the participant Used Cooking Type of fuel, third history
database_cross_reference: PATO:0001995
internal ID: CookingMethod_3

socio-demographic and economic characteristics
type: Axiom
annotated source: CookingMethod_3
annotated property: database_cross_reference
annotated target: PATO:0001995

WorkEverWorkedFlag
type: Class
subclass of: Job
definition: Working for at least one year of full-time job
database_cross_reference: PATO:0001995
internal ID: WorkEverWorkedFlag

socio-demographic and economic characteristics
type: Axiom
annotated source: WorkEverWorkedFlag
annotated property: database_cross_reference
annotated target: PATO:0001995

WorkAgeBegan
type: Class
subclass of: Job
definition: Specifies participant start work age
database_cross_reference: PATO:0001995
internal ID: WorkAgeBegan

socio-demographic and economic characteristics
type: Axiom
annotated source: WorkAgeBegan
annotated property: database_cross_reference
annotated target: PATO:0001995

WorkCurrently
type: Class
subclass of: Job
definition: Specifies participant work now
database_cross_reference: PATO:0001995
internal ID: WorkCurrently

socio-demographic and economic characteristics
type: Axiom
annotated source: WorkCurrently
annotated property: database_cross_reference
annotated target: PATO:0001995

JobsStartAge
type: Class
subclass of: Job
definition: Age of starting the job for last history
database_cross_reference: PATO:0001995
internal ID: JobsStartAge

socio-demographic and economic characteristics
type: Axiom
annotated source: JobsStartAge
annotated property: database_cross_reference
annotated target: PATO:0001995

JobsEndAge
type: Class
subclass of: Job
definition: Age of quiting the job for last history
database_cross_reference: PATO:0001995
internal ID: JobsEndAge

socio-demographic and economic characteristics
type: Axiom
annotated source: JobsEndAge
annotated property: database_cross_reference
annotated target: PATO:0001995

JobsTitleOccupation
type: Class
subclass of: Job
definition: Name of the job
database_cross_reference: PATO:0001995
internal ID: JobsTitleOccupation

socio-demographic and economic characteristics
type: Axiom
annotated source: JobsTitleOccupation
annotated property: database_cross_reference
annotated target: PATO:0001995

JobsTitleOccupationCode
type: Class
subclass of: Job
definition: Code of the job (Appendix)
database_cross_reference: PATO:0001995
internal ID: JobsTitleOccupationCode

socio-demographic and economic characteristics
type: Axiom
annotated source: JobsTitleOccupationCode
annotated property: database_cross_reference
annotated target: PATO:0001995

JobsHoursPerDay
type: Class
subclass of: Job
definition: Number of working hours per day
database_cross_reference: PATO:0001995
internal ID: JobsHoursPerDay

socio-demographic and economic characteristics
type: Axiom
annotated source: JobsHoursPerDay
annotated property: database_cross_reference
annotated target: PATO:0001995

JobsIntensity
type: Class
subclass of: Job
definition: The intensity of physical activity during the job
database_cross_reference: PATO:0001995
internal ID: JobsIntensity

socio-demographic and economic characteristics
type: Axiom
annotated source: JobsIntensity
annotated property: database_cross_reference
annotated target: PATO:0001995

JobMonthPerYear
type: Class
subclass of: Job
definition: Number of working months per year
database_cross_reference: PATO:0001995
internal ID: JobMonthPerYear

socio-demographic and economic characteristics
type: Axiom
annotated source: JobMonthPerYear
annotated property: database_cross_reference
annotated target: PATO:0001995

HusbandOccupation
type: Class
subclass of: Job
definition: Code of the husband job (Appendix)
database_cross_reference: PATO:0001995
internal ID: HusbandOccupation

socio-demographic and economic characteristics
type: Axiom
annotated source: HusbandOccupation
annotated property: database_cross_reference
annotated target: PATO:0001995

FoodWatFoodPreserve
type: Class
subclass of: Food preservation and cooking
definition: Specifies How to Preserve foods
database_cross_reference: PATO:0001995
internal ID: FoodWatFoodPreserve

socio-demographic and economic characteristics
type: Axiom
annotated source: FoodWatFoodPreserve
annotated property: database_cross_reference
annotated target: PATO:0001995

FoodWatBreadPreserve
type: Class
subclass of: Food preservation and cooking
definition: Specifies How to Preserve bread
database_cross_reference: PATO:0001995
internal ID: FoodWatBreadPreserve

socio-demographic and economic characteristics
type: Axiom
annotated source: FoodWatBreadPreserve
annotated property: database_cross_reference
annotated target: PATO:0001995

FoodWatShallowFryVeg
type: Class
subclass of: Food preservation and cooking
definition: Specifies Using vegetable in Small frying
database_cross_reference: PATO:0001995
internal ID: FoodWatShallowFryVeg

socio-demographic and economic characteristics
type: Axiom
annotated source: FoodWatShallowFryVeg
annotated property: database_cross_reference
annotated target: PATO:0001995

FoodWatShallowFryMeat
type: Class
subclass of: Food preservation and cooking
definition: Specifies Using Meat in Small frying
database_cross_reference: PATO:0001995
internal ID: FoodWatShallowFryMeat

socio-demographic and economic characteristics
type: Axiom
annotated source: FoodWatShallowFryMeat
annotated property: database_cross_reference
annotated target: PATO:0001995

FoodWatShallowFryFish
type: Class
subclass of: Food preservation and cooking
definition: Specifies Using Fish in Small frying
database_cross_reference: PATO:0001995
internal ID: FoodWatShallowFryFish

socio-demographic and economic characteristics
type: Axiom
annotated source: FoodWatShallowFryFish
annotated property: database_cross_reference
annotated target: PATO:0001995

FoodWatDeepFryVeg
type: Class
subclass of: Food preservation and cooking
definition: Specifies Using vegetable in Deep frying
database_cross_reference: PATO:0001995
internal ID: FoodWatDeepFryVeg

socio-demographic and economic characteristics
type: Axiom
annotated source: FoodWatDeepFryVeg
annotated property: database_cross_reference
annotated target: PATO:0001995

FoodWatDeepFryMeat
type: Class
subclass of: Food preservation and cooking
definition: Specifies Using Meat in Deep frying
database_cross_reference: PATO:0001995
internal ID: FoodWatDeepFryMeat

socio-demographic and economic characteristics
type: Axiom
annotated source: FoodWatDeepFryMeat
annotated property: database_cross_reference
annotated target: PATO:0001995

FoodWatDeepFryFish
type: Class
subclass of: Food preservation and cooking
definition: Specifies Using Fish in Deep frying
database_cross_reference: PATO:0001995
internal ID: FoodWatDeepFryFish

socio-demographic and economic characteristics
type: Axiom
annotated source: FoodWatDeepFryFish
annotated property: database_cross_reference
annotated target: PATO:0001995

FoodWatBBQVeg
type: Class
subclass of: Food preservation and cooking
definition: Specifies Using vegetable in BBQ
database_cross_reference: PATO:0001995
internal ID: FoodWatBBQVeg

socio-demographic and economic characteristics
type: Axiom
annotated source: FoodWatBBQVeg
annotated property: database_cross_reference
annotated target: PATO:0001995

FoodWatBBQMeat
type: Class
subclass of: Food preservation and cooking
definition: Specifies Using Meat in BBQ
database_cross_reference: PATO:0001995
internal ID: FoodWatBBQMeat

socio-demographic and economic characteristics
type: Axiom
annotated source: FoodWatBBQMeat
annotated property: database_cross_reference
annotated target: PATO:0001995

FoodWatBBQFish
type: Class
subclass of: Food preservation and cooking
definition: Specifies Using Fish in BBQ
database_cross_reference: PATO:0001995
internal ID: FoodWatBBQFish

socio-demographic and economic characteristics
type: Axiom
annotated source: FoodWatBBQFish
annotated property: database_cross_reference
annotated target: PATO:0001995

FoodWatBoilVeg
type: Class
subclass of: Food preservation and cooking
definition: Specifies Using vegetable Boiling
database_cross_reference: PATO:0001995
internal ID: FoodWatBoilVeg

socio-demographic and economic characteristics
type: Axiom
annotated source: FoodWatBoilVeg
annotated property: database_cross_reference
annotated target: PATO:0001995

FoodWatBoilMeat
type: Class
subclass of: Food preservation and cooking
definition: Specifies Using Meat Boiling
database_cross_reference: PATO:0001995
internal ID: FoodWatBoilMeat

socio-demographic and economic characteristics
type: Axiom
annotated source: FoodWatBoilMeat
annotated property: database_cross_reference
annotated target: PATO:0001995

FoodWatBoilFish
type: Class
subclass of: Food preservation and cooking
definition: Specifies Using Fish Boiling
database_cross_reference: PATO:0001995
internal ID: FoodWatBoilFish

socio-demographic and economic characteristics
type: Axiom
annotated source: FoodWatBoilFish
annotated property: database_cross_reference
annotated target: PATO:0001995

FoodWatSteamVeg
type: Class
subclass of: Food preservation and cooking
definition: Specifies Using vegetable Steaming
database_cross_reference: PATO:0001995
internal ID: FoodWatSteamVeg

socio-demographic and economic characteristics
type: Axiom
annotated source: FoodWatSteamVeg
annotated property: database_cross_reference
annotated target: PATO:0001995

FoodWatSteamMeat
type: Class
subclass of: Food preservation and cooking
definition: Specifies Using Meat Steaming
database_cross_reference: PATO:0001995
internal ID: FoodWatSteamMeat

socio-demographic and economic characteristics
type: Axiom
annotated source: FoodWatSteamMeat
annotated property: database_cross_reference
annotated target: PATO:0001995

FoodWatSteamFish
type: Class
subclass of: Food preservation and cooking
definition: Specifies Using Fish Steaming
database_cross_reference: PATO:0001995
internal ID: FoodWatSteamFish

socio-demographic and economic characteristics
type: Axiom
annotated source: FoodWatSteamFish
annotated property: database_cross_reference
annotated target: PATO:0001995

FoodWatOthVeg
type: Class
subclass of: Food preservation and cooking
definition: Specifies Using vegetable by any Other method
database_cross_reference: PATO:0001995
internal ID: FoodWatOthVeg

socio-demographic and economic characteristics
type: Axiom
annotated source: FoodWatOthVeg
annotated property: database_cross_reference
annotated target: PATO:0001995

FoodWatOthMeat
type: Class
subclass of: Food preservation and cooking
definition: Specifies Using Meat by any Other method
database_cross_reference: PATO:0001995
internal ID: FoodWatOthMeat

socio-demographic and economic characteristics
type: Axiom
annotated source: FoodWatOthMeat
annotated property: database_cross_reference
annotated target: PATO:0001995

FoodWatOthFish
type: Class
subclass of: Food preservation and cooking
definition: Specifies Using Fish in by any Other method
database_cross_reference: PATO:0001995
internal ID: FoodWatOthFish

socio-demographic and economic characteristics
type: Axiom
annotated source: FoodWatOthFish
annotated property: database_cross_reference
annotated target: PATO:0001995

FoodWatFreshLocalFruitChange
type: Class
subclass of: Food preservation and cooking
definition: Specifies the change in using Local Fruit from 1353
database_cross_reference: PATO:0001995
internal ID: FoodWatFreshLocalFruitChange

socio-demographic and economic characteristics
type: Axiom
annotated source: FoodWatFreshLocalFruitChange
annotated property: database_cross_reference
annotated target: PATO:0001995

FoodWatFreshImportedFruitChange
type: Class
subclass of: Food preservation and cooking
definition: Specifies the change in using Imported Fruit from 1353
database_cross_reference: PATO:0001995
internal ID: FoodWatFreshImportedFruitChange

socio-demographic and economic characteristics
type: Axiom
annotated source: FoodWatFreshImportedFruitChange
annotated property: database_cross_reference
annotated target: PATO:0001995

FoodWatFreshVegChange
type: Class
subclass of: Food preservation and cooking
definition: Specifies the change in using Fresh Vegetable from 1353
database_cross_reference: PATO:0001995
internal ID: FoodWatFreshVegChange

socio-demographic and economic characteristics
type: Axiom
annotated source: FoodWatFreshVegChange
annotated property: database_cross_reference
annotated target: PATO:0001995

FoodWatFreshMeatChange
type: Class
subclass of: Food preservation and cooking
definition: Specifies the change in using Fresh Meat from 1353
database_cross_reference: PATO:0001995
internal ID: FoodWatFreshMeatChange

socio-demographic and economic characteristics
type: Axiom
annotated source: FoodWatFreshMeatChange
annotated property: database_cross_reference
annotated target: PATO:0001995

Homeownership
type: Class
subclass of: Properties
definition: Specifies participant Homeownership status
database_cross_reference: PATO:0001995
internal ID: Homeownership

socio-demographic and economic characteristics
type: Axiom
annotated source: Homeownership
annotated property: database_cross_reference
annotated target: PATO:0001995

house_nonowned
type: Class
subclass of: Properties
definition: Specifies house owned or non-owned
database_cross_reference: PATO:0001995
internal ID: house_nonowned

socio-demographic and economic characteristics
type: Axiom
annotated source: house_nonowned
annotated property: database_cross_reference
annotated target: PATO:0001995

HomeSize
type: Class
subclass of: Properties
definition: Specifies participant Home Area
database_cross_reference: PATO:0001995
internal ID: HomeSize

socio-demographic and economic characteristics
type: Axiom
annotated source: HomeSize
annotated property: database_cross_reference
annotated target: PATO:0001995

PropertyAutoOwned
type: Class
subclass of: Properties
definition: If the participant has personal car select yes if no select no
database_cross_reference: PATO:0001995
internal ID: PropertyAutoOwned

socio-demographic and economic characteristics
type: Axiom
annotated source: PropertyAutoOwned
annotated property: database_cross_reference
annotated target: PATO:0001995

PropertyAutoYears
type: Class
subclass of: Properties
definition: Specifies the length of time that the participant has a personal car(Year)
database_cross_reference: PATO:0001995
internal ID: PropertyAutoYears

socio-demographic and economic characteristics
type: Axiom
annotated source: PropertyAutoYears
annotated property: database_cross_reference
annotated target: PATO:0001995

PropertyMotorcycleOwned
type: Class
subclass of: Properties
definition: If the participant has Motorcycle select yes if no select no
database_cross_reference: PATO:0001995
internal ID: PropertyMotorcycleOwned

socio-demographic and economic characteristics
type: Axiom
annotated source: PropertyMotorcycleOwned
annotated property: database_cross_reference
annotated target: PATO:0001995

PropertyMotorcycleYears
type: Class
subclass of: Properties
definition: Specifies the length of time that the participant has Motorcycle(Year)
database_cross_reference: PATO:0001995
internal ID: PropertyMotorcycleYears

socio-demographic and economic characteristics
type: Axiom
annotated source: PropertyMotorcycleYears
annotated property: database_cross_reference
annotated target: PATO:0001995

PropertyColorTVOwned
type: Class
subclass of: Properties
definition: If the participant has Color TV select yes if no select no
database_cross_reference: PATO:0001995
internal ID: PropertyColorTVOwned

socio-demographic and economic characteristics
type: Axiom
annotated source: PropertyColorTVOwned
annotated property: database_cross_reference
annotated target: PATO:0001995

PropertyColorTVYears
type: Class
subclass of: Properties
definition: Specifies the length of time that the participant has Color TV(Year)
database_cross_reference: PATO:0001995
internal ID: PropertyColorTVYears

socio-demographic and economic characteristics
type: Axiom
annotated source: PropertyColorTVYears
annotated property: database_cross_reference
annotated target: PATO:0001995

PropertyBandWTVOwned
type: Class
subclass of: Properties
definition: If the participant has BandW TV select yes if no select no
database_cross_reference: PATO:0001995
internal ID: PropertyBandWTVOwned

socio-demographic and economic characteristics
type: Axiom
annotated source: PropertyBandWTVOwned
annotated property: database_cross_reference
annotated target: PATO:0001995

PropertyBandWTVYears
type: Class
subclass of: Properties
definition: Specifies the length of time that the participant has BandW TV(Year)
database_cross_reference: PATO:0001995
internal ID: PropertyBandWTVYears

socio-demographic and economic characteristics
type: Axiom
annotated source: PropertyBandWTVYears
annotated property: database_cross_reference
annotated target: PATO:0001995

PropertyIndoorBathOwned
type: Class
subclass of: Properties
definition: If the participant has Indoor Bath room select yes if no select no
database_cross_reference: PATO:0001995
internal ID: PropertyIndoorBathOwned

socio-demographic and economic characteristics
type: Axiom
annotated source: PropertyIndoorBathOwned
annotated property: database_cross_reference
annotated target: PATO:0001995

PropertyIndoorBathYears
type: Class
subclass of: Properties
definition: Specifies the length of time that the participant has Indoor Bath room(Year)
database_cross_reference: PATO:0001995
internal ID: PropertyIndoorBathYears

socio-demographic and economic characteristics
type: Axiom
annotated source: PropertyIndoorBathYears
annotated property: database_cross_reference
annotated target: PATO:0001995

PropertyVacuumOwned
type: Class
subclass of: Properties
definition: If the participant has Vacuum cleaner select yes if no select no
database_cross_reference: PATO:0001995
internal ID: PropertyVacuumOwned

socio-demographic and economic characteristics
type: Axiom
annotated source: PropertyVacuumOwned
annotated property: database_cross_reference
annotated target: PATO:0001995

PropertyVacuumYears
type: Class
subclass of: Properties
definition: Specifies the length of time that the participant has Vacuum cleaner(Year)
database_cross_reference: PATO:0001995
internal ID: PropertyVacuumYears

socio-demographic and economic characteristics
type: Axiom
annotated source: PropertyVacuumYears
annotated property: database_cross_reference
annotated target: PATO:0001995

PropertyWashMachOwned
type: Class
subclass of: Properties
definition: If the participant has Washing machine select yes if no select no
database_cross_reference: PATO:0001995
internal ID: PropertyWashMachOwned

socio-demographic and economic characteristics
type: Axiom
annotated source: PropertyWashMachOwned
annotated property: database_cross_reference
annotated target: PATO:0001995

PropertyWashMachYears
type: Class
subclass of: Properties
definition: Specifies the length of time that the participant has Washing machine(Year)
database_cross_reference: PATO:0001995
internal ID: PropertyWashMachYears

socio-demographic and economic characteristics
type: Axiom
annotated source: PropertyWashMachYears
annotated property: database_cross_reference
annotated target: PATO:0001995

PropertyRefrigeratorOwned
type: Class
subclass of: Properties
definition: If the participant has Refrigerator select yes if no select no
database_cross_reference: PATO:0001995
internal ID: PropertyRefrigeratorOwned

socio-demographic and economic characteristics
type: Axiom
annotated source: PropertyRefrigeratorOwned
annotated property: database_cross_reference
annotated target: PATO:0001995

PropertyRefrigeratorYears
type: Class
subclass of: Properties
definition: Specifies the length of time that the participant has Refrigerator(Year)
database_cross_reference: PATO:0001995
internal ID: PropertyRefrigeratorYears

socio-demographic and economic characteristics
type: Axiom
annotated source: PropertyRefrigeratorYears
annotated property: database_cross_reference
annotated target: PATO:0001995

PropertyFreezerOwned
type: Class
subclass of: Properties
definition: If the participant has Freezer select yes if no select no
database_cross_reference: PATO:0001995
internal ID: PropertyFreezerOwned

socio-demographic and economic characteristics
type: Axiom
annotated source: PropertyFreezerOwned
annotated property: database_cross_reference
annotated target: PATO:0001995

PropertyFreezerYears
type: Class
subclass of: Properties
definition: Specifies the length of time that the participant has Freezer(Year)
database_cross_reference: PATO:0001995
internal ID: PropertyFreezerYears

socio-demographic and economic characteristics
type: Axiom
annotated source: PropertyFreezerYears
annotated property: database_cross_reference
annotated target: PATO:0001995

PropertyComputerOwned
type: Class
subclass of: Properties
definition: If the participant has Computer select yes if no select no
database_cross_reference: PATO:0001995
internal ID: PropertyComputerOwned

socio-demographic and economic characteristics
type: Axiom
annotated source: PropertyComputerOwned
annotated property: database_cross_reference
annotated target: PATO:0001995

PropertyComputerYears
type: Class
subclass of: Properties
definition: Specifies the length of time that the participant has Computer(Year)
database_cross_reference: PATO:0001995
internal ID: PropertyComputerYears

socio-demographic and economic characteristics
type: Axiom
annotated source: PropertyComputerYears
annotated property: database_cross_reference
annotated target: PATO:0001995

HomeRooms
type: Class
subclass of: Properties
definition: Number of rooms in the house
database_cross_reference: PATO:0001995
internal ID: HomeRooms

socio-demographic and economic characteristics
type: Axiom
annotated source: HomeRooms
annotated property: database_cross_reference
annotated target: PATO:0001995

HaveBath
type: Class
subclass of: Properties
definition: Specifies if the household has bathroom
database_cross_reference: PATO:0001995
internal ID: HaveBath

socio-demographic and economic characteristics
type: Axiom
annotated source: HaveBath
annotated property: database_cross_reference
annotated target: PATO:0001995

HaveKitchen
type: Class
subclass of: Properties
definition: Specifies if the household has kitchen
database_cross_reference: PATO:0001995
internal ID: HaveKitchen

socio-demographic and economic characteristics
type: Axiom
annotated source: HaveKitchen
annotated property: database_cross_reference
annotated target: PATO:0001995

MCA
type: Class
subclass of: Properties
definition: Composite wealth score (Multiple Correspondence Analysis)
database_cross_reference: PATO:0001995
internal ID: MCA

socio-demographic and economic characteristics
type: Axiom
annotated source: MCA
annotated property: database_cross_reference
annotated target: PATO:0001995

NumberPregnancies
type: Class
subclass of: Medical History
definition: Specifies the number of Pregnancies for women only
database_cross_reference: PATO:0001995
internal ID: NumberPregnancies

socio-demographic and economic characteristics
type: Axiom
annotated source: NumberPregnancies
annotated property: database_cross_reference
annotated target: PATO:0001995

NumberLiveBirths
type: Class
subclass of: Medical History
definition: Specifies the number of live births for women only
database_cross_reference: PATO:0001995
internal ID: NumberLiveBirths

socio-demographic and economic characteristics
type: Axiom
annotated source: NumberLiveBirths
annotated property: database_cross_reference
annotated target: PATO:0001995

DisRheumaticHeartDx
type: Class
subclass of: Medical History
definition: if the diagnosis of Rheumatic Heart Disease was made for participant by a physician
database_cross_reference: MONDO:0004995
internal ID: DisRheumaticHeartDx

cardiovascular diseases
type: Axiom
annotated source: DisRheumaticHeartDx
annotated property: database_cross_reference
annotated target: MONDO:0004995

DisRheumaticHeartAge
type: Class
subclass of: Medical History
definition: participant age at Rheumatic Heart Disease diagnosis
database_cross_reference: MONDO:0004995
internal ID: DisRheumaticHeartAge

cardiovascular diseases
type: Axiom
annotated source: DisRheumaticHeartAge
annotated property: database_cross_reference
annotated target: MONDO:0004995

DisHeartDiseaseDx
type: Class
subclass of: Medical History
definition: if the diagnosis of Heart Disease was made for participant by a physician
database_cross_reference: MONDO:0004995
internal ID: DisHeartDiseaseDx

cardiovascular diseases
type: Axiom
annotated source: DisHeartDiseaseDx
annotated property: database_cross_reference
annotated target: MONDO:0004995

DisHeartDiseaseAge
type: Class
subclass of: Medical History
definition: participant age in first Heart Disease diagnosis
database_cross_reference: MONDO:0004995
internal ID: DisHeartDiseaseAge

cardiovascular diseases
type: Axiom
annotated source: DisHeartDiseaseAge
annotated property: database_cross_reference
annotated target: MONDO:0004995

DisStrokeDx
type: Class
subclass of: Medical History
definition: if the diagnosis of Stroke was made for participant by a physician
database_cross_reference: OGMS:0000020
internal ID: DisStrokeDx

signs and symptoms
type: Axiom
annotated source: DisStrokeDx
annotated property: database_cross_reference
annotated target: OGMS:0000020

DisStrokeAge
type: Class
subclass of: Medical History
definition: participant age in first Stroke diagnosis
database_cross_reference: OGMS:0000020
internal ID: DisStrokeAge

signs and symptoms
type: Axiom
annotated source: DisStrokeAge
annotated property: database_cross_reference
annotated target: OGMS:0000020

DisHypertensionDx
type: Class
subclass of: Medical History
definition: if the diagnosis of Hypertension was made for participant by a physician
database_cross_reference: MONDO:0004995
internal ID: DisHypertensionDx

cardiovascular diseases
type: Axiom
annotated source: DisHypertensionDx
annotated property: database_cross_reference
annotated target: MONDO:0004995

DisHypertensionAge
type: Class
subclass of: Medical History
definition: participant age in first Hypertension diagnosis
database_cross_reference: MONDO:0004995
internal ID: DisHypertensionAge

cardiovascular diseases
type: Axiom
annotated source: DisHypertensionAge
annotated property: database_cross_reference
annotated target: MONDO:0004995

DisDiabetesDx
type: Class
subclass of: Medical History
definition: if the diagnosis of Diabetes was made for participant by a physician
database_cross_reference: MONDO:0005151
internal ID: DisDiabetesDx

endocrine system diseases
type: Axiom
annotated source: DisDiabetesDx
annotated property: database_cross_reference
annotated target: MONDO:0005151

DisDiabetesAge
type: Class
subclass of: Medical History
definition: participant age in first Diabetes diagnosis
database_cross_reference: MONDO:0005151
internal ID: DisDiabetesAge

endocrine system diseases
type: Axiom
annotated source: DisDiabetesAge
annotated property: database_cross_reference
annotated target: MONDO:0005151

DisCOPDDx
type: Class
subclass of: Medical History
definition: if the diagnosis of COPD was made for participant by a physician
database_cross_reference: MONDO:0005087
internal ID: DisCOPDDx

respiratory system diseases
type: Axiom
annotated source: DisCOPDDx
annotated property: database_cross_reference
annotated target: MONDO:0005087

DisCOPDAge
type: Class
subclass of: Medical History
definition: participant age in first COPD diagnosis
database_cross_reference: MONDO:0005087
internal ID: DisCOPDAge

respiratory system diseases
type: Axiom
annotated source: DisCOPDAge
annotated property: database_cross_reference
annotated target: MONDO:0005087

DisRenalFailureDx
type: Class
subclass of: Medical History
definition: if the diagnosis of Renal Failure was made for participant by a physician
database_cross_reference: MONDO:0005151
internal ID: DisRenalFailureDx

endocrine system diseases
type: Axiom
annotated source: DisRenalFailureDx
annotated property: database_cross_reference
annotated target: MONDO:0005151

DisRenalFailureAge
type: Class
subclass of: Medical History
definition: participant age in first RenalFailure diagnosis
database_cross_reference: MONDO:0005151
internal ID: DisRenalFailureAge

endocrine system diseases
type: Axiom
annotated source: DisRenalFailureAge
annotated property: database_cross_reference
annotated target: MONDO:0005151

DisJaundiceDx
type: Class
subclass of: Medical History
definition: if the diagnosis of Jaundice was made for participant by a physician
database_cross_reference: MONDO:0005151
internal ID: DisJaundiceDx

endocrine system diseases
type: Axiom
annotated source: DisJaundiceDx
annotated property: database_cross_reference
annotated target: MONDO:0005151

DisJaundiceAge
type: Class
subclass of: Medical History
definition: participant age in first Jaundice diagnosis
database_cross_reference: MONDO:0005151
internal ID: DisJaundiceAge

endocrine system diseases
type: Axiom
annotated source: DisJaundiceAge
annotated property: database_cross_reference
annotated target: MONDO:0005151

DisLiverDx
type: Class
subclass of: Medical History
definition: if the diagnosis of Chronic Liver Failure was made for participant by a physician
database_cross_reference: MONDO:0005151
internal ID: DisLiverDx

endocrine system diseases
type: Axiom
annotated source: DisLiverDx
annotated property: database_cross_reference
annotated target: MONDO:0005151

DisLiverAge
type: Class
subclass of: Medical History
definition: participant age in first Chronic liver failure diagnosis
database_cross_reference: MONDO:0005151
internal ID: DisLiverAge

endocrine system diseases
type: Axiom
annotated source: DisLiverAge
annotated property: database_cross_reference
annotated target: MONDO:0005151

DisTBDx
type: Class
subclass of: Medical History
definition: if the diagnosis of Tuberculosis was made for participant by a physician
database_cross_reference: MONDO:0000001
internal ID: DisTBDx

diseases
type: Axiom
annotated source: DisTBDx
annotated property: database_cross_reference
annotated target: MONDO:0000001

DisTBAge
type: Class
subclass of: Medical History
definition: participant age in first Tuberculosis diagnosis
database_cross_reference: MONDO:0000001
internal ID: DisTBAge

diseases
type: Axiom
annotated source: DisTBAge
annotated property: database_cross_reference
annotated target: MONDO:0000001

SurgeryFlag
type: Class
subclass of: Medical History
definition: If the participant had had any history of surgery
database_cross_reference: GECKO:0000092
internal ID: SurgeryFlag

surgical interventions
type: Axiom
annotated source: SurgeryFlag
annotated property: database_cross_reference
annotated target: GECKO:0000092

SurgeryType
type: Class
subclass of: Medical History
definition: Specifies the participant surgery Type
database_cross_reference: GECKO:0000092
internal ID: SurgeryType

surgical interventions
type: Axiom
annotated source: SurgeryType
annotated property: database_cross_reference
annotated target: GECKO:0000092

SurgeryAge
type: Class
subclass of: Medical History
definition: Specifies the participant age in surgery Time
database_cross_reference: GECKO:0000092
internal ID: SurgeryAge

surgical interventions
type: Axiom
annotated source: SurgeryAge
annotated property: database_cross_reference
annotated target: GECKO:0000092

TransfusionFlag
type: Class
subclass of: Medical History
definition: if the participant has had Transfusion history
database_cross_reference: GECKO:0000091
internal ID: TransfusionFlag

non-pharmacological interventions
type: Axiom
annotated source: TransfusionFlag
annotated property: database_cross_reference
annotated target: GECKO:0000091

TransfusionRecentFlag
type: Class
subclass of: Medical History
definition: if the participant has Transfusion history in last month
database_cross_reference: GECKO:0000091
internal ID: TransfusionRecentFlag

non-pharmacological interventions
type: Axiom
annotated source: TransfusionRecentFlag
annotated property: database_cross_reference
annotated target: GECKO:0000091

SymRefluxFlag
type: Class
subclass of: Chief complaints
definition: if the participant has Reflux Symptom history select yes if not select no
database_cross_reference: OGMS:0000020
internal ID: SymRefluxFlag

signs and symptoms
type: Axiom
annotated source: SymRefluxFlag
annotated property: database_cross_reference
annotated target: OGMS:0000020

SymRefluxWhen
type: Class
subclass of: Chief complaints
definition: when Reflux Symptom happen in First time
database_cross_reference: OGMS:0000020
internal ID: SymRefluxWhen

signs and symptoms
type: Axiom
annotated source: SymRefluxWhen
annotated property: database_cross_reference
annotated target: OGMS:0000020

SymHeartburnFlag
type: Class
subclass of: Chief complaints
definition: if the participant has Heartburn Symptom history select yes if not select no
database_cross_reference: OGMS:0000020
internal ID: SymHeartburnFlag

signs and symptoms
type: Axiom
annotated source: SymHeartburnFlag
annotated property: database_cross_reference
annotated target: OGMS:0000020

SymHeartburnWhen
type: Class
subclass of: Chief complaints
definition: when Heartburn Symptom happen in First time
database_cross_reference: OGMS:0000020
internal ID: SymHeartburnWhen

signs and symptoms
type: Axiom
annotated source: SymHeartburnWhen
annotated property: database_cross_reference
annotated target: OGMS:0000020

SymDifficultSwallowingFlag
type: Class
subclass of: Chief complaints
definition: if the participant has Difficult Swallowing Symptom history select yes if not select no
database_cross_reference: OGMS:0000020
internal ID: SymDifficultSwallowingFlag

signs and symptoms
type: Axiom
annotated source: SymDifficultSwallowingFlag
annotated property: database_cross_reference
annotated target: OGMS:0000020

SymDifficultSwallowingWhen
type: Class
subclass of: Chief complaints
definition: when Difficult Swallowing Symptom happen in First time
database_cross_reference: OGMS:0000020
internal ID: SymDifficultSwallowingWhen

signs and symptoms
type: Axiom
annotated source: SymDifficultSwallowingWhen
annotated property: database_cross_reference
annotated target: OGMS:0000020

SymRefluxPastYearFreq
type: Class
subclass of: Chief complaints
definition: if the participant has Reflux Symptom in past year select yes if not select no
database_cross_reference: OGMS:0000020
internal ID: SymRefluxPastYearFreq

signs and symptoms
type: Axiom
annotated source: SymRefluxPastYearFreq
annotated property: database_cross_reference
annotated target: OGMS:0000020

SymRefluxPastYearSeverity
type: Class
subclass of: Chief complaints
definition: Severity Reflux Symptom in past year
database_cross_reference: OGMS:0000020
internal ID: SymRefluxPastYearSeverity

signs and symptoms
type: Axiom
annotated source: SymRefluxPastYearSeverity
annotated property: database_cross_reference
annotated target: OGMS:0000020

SymRefluxPriorYearsFreq
type: Class
subclass of: Chief complaints
definition: if the participant has Reflux Symptom in Prior year select yes if not select no
database_cross_reference: OGMS:0000020
internal ID: SymRefluxPriorYearsFreq

signs and symptoms
type: Axiom
annotated source: SymRefluxPriorYearsFreq
annotated property: database_cross_reference
annotated target: OGMS:0000020

SymRefluxPriorYearsSeverity
type: Class
subclass of: Chief complaints
definition: Severity Reflux Symptom in Prior year
database_cross_reference: OGMS:0000020
internal ID: SymRefluxPriorYearsSeverity

signs and symptoms
type: Axiom
annotated source: SymRefluxPriorYearsSeverity
annotated property: database_cross_reference
annotated target: OGMS:0000020

RefluxHeartburnTXFlag
type: Class
subclass of: Chief complaints
definition: if participant used drug for Heartburn symptoms select yes if not select no and if participant doesn't have symtom selectLack of signage
database_cross_reference: OGMS:0000020
internal ID: RefluxHeartburnTXFlag

signs and symptoms
type: Axiom
annotated source: RefluxHeartburnTXFlag
annotated property: database_cross_reference
annotated target: OGMS:0000020

WeightLossFlag
type: Class
subclass of: Chief complaints
definition: if the patient has Weightloss in past year select yes if not select no
database_cross_reference: OGMS:0000020
internal ID: WeightLossFlag

signs and symptoms
type: Axiom
annotated source: WeightLossFlag
annotated property: database_cross_reference
annotated target: OGMS:0000020

WeightLossAmount
type: Class
subclass of: Chief complaints
definition: Specifies the amount of weight loss
database_cross_reference: OGMS:0000020
internal ID: WeightLossAmount

signs and symptoms
type: Axiom
annotated source: WeightLossAmount
annotated property: database_cross_reference
annotated target: OGMS:0000020

WeightLossIntent
type: Class
subclass of: Chief complaints
definition: if the patient has Intentional weight loss select Yes if not select no and doesn't have weight loss select I have no weight loss
database_cross_reference: OGMS:0000020
internal ID: WeightLossIntent

signs and symptoms
type: Axiom
annotated source: WeightLossIntent
annotated property: database_cross_reference
annotated target: OGMS:0000020

cancerdxflag
type: Class
subclass of: Cancer History
definition: Past history of cancer diagnosed by a physician?
database_cross_reference: MONDO:0004992
internal ID: cancerdxflag

cancer
type: Axiom
annotated source: cancerdxflag
annotated property: database_cross_reference
annotated target: MONDO:0004992

cancerdxage
type: Class
subclass of: Cancer History
definition: Year of diagnosis of cancer if detected in participant
database_cross_reference: MONDO:0004992
internal ID: cancerdxage

cancer
type: Axiom
annotated source: cancerdxage
annotated property: database_cross_reference
annotated target: MONDO:0004992

cancerdxsite
type: Class
subclass of: Cancer History
definition: Original site of cancer
database_cross_reference: MONDO:0004992
internal ID: cancerdxsite

cancer
type: Axiom
annotated source: cancerdxsite
annotated property: database_cross_reference
annotated target: MONDO:0004992

CancRelRelativeCode_1
type: Class
subclass of: Cancer History
definition: Specifies the relative of participants with a history of cancer
database_cross_reference: MONDO:0004992
internal ID: CancRelRelativeCode_1

cancer
type: Axiom
annotated source: CancRelRelativeCode_1
annotated property: database_cross_reference
annotated target: MONDO:0004992

CancRelAgeDiagnosis_1
type: Class
subclass of: Cancer History
definition: Specifies the age of relative when cancer was diagnosed
database_cross_reference: MONDO:0004992
internal ID: CancRelAgeDiagnosis_1

cancer
type: Axiom
annotated source: CancRelAgeDiagnosis_1
annotated property: database_cross_reference
annotated target: MONDO:0004992

CancRelSite_1
type: Class
subclass of: Cancer History
definition: Specifies the site of cancer in the relative of participant
database_cross_reference: MONDO:0004992
internal ID: CancRelSite_1

cancer
type: Axiom
annotated source: CancRelSite_1
annotated property: database_cross_reference
annotated target: MONDO:0004992

CancRelICD10_1
type: Class
subclass of: Cancer History
definition: Specifies the ICD-10 code of cancer in the relative of participant
database_cross_reference: MONDO:0004992
internal ID: CancRelICD10_1

cancer
type: Axiom
annotated source: CancRelICD10_1
annotated property: database_cross_reference
annotated target: MONDO:0004992

CancRelRelativeCode_2
type: Class
subclass of: Cancer History
definition: Specifies the additional relative of participants with a history of cancer
database_cross_reference: MONDO:0004992
internal ID: CancRelRelativeCode_2

cancer
type: Axiom
annotated source: CancRelRelativeCode_2
annotated property: database_cross_reference
annotated target: MONDO:0004992

CancRelAgeDiagnosis_2
type: Class
subclass of: Cancer History
definition: Specifies the age of relative when cancer was diagnosed
database_cross_reference: MONDO:0004992
internal ID: CancRelAgeDiagnosis_2

cancer
type: Axiom
annotated source: CancRelAgeDiagnosis_2
annotated property: database_cross_reference
annotated target: MONDO:0004992

CancRelSite_2
type: Class
subclass of: Cancer History
definition: Specifies the site of cancer in the relative of participant
database_cross_reference: MONDO:0004992
internal ID: CancRelSite_2

cancer
type: Axiom
annotated source: CancRelSite_2
annotated property: database_cross_reference
annotated target: MONDO:0004992

CancRelICD10_2
type: Class
subclass of: Cancer History
definition: Specifies the ICD-10 code of cancer in the relative of participant
database_cross_reference: MONDO:0004992
internal ID: CancRelICD10_2

cancer
type: Axiom
annotated source: CancRelICD10_2
annotated property: database_cross_reference
annotated target: MONDO:0004992

CancRelRelativeCode_3
type: Class
subclass of: Cancer History
definition: Specifies the additional relative of participants with a history of cancer
database_cross_reference: MONDO:0004992
internal ID: CancRelRelativeCode_3

cancer
type: Axiom
annotated source: CancRelRelativeCode_3
annotated property: database_cross_reference
annotated target: MONDO:0004992

CancRelAgeDiagnosis_3
type: Class
subclass of: Cancer History
definition: Specifies the age of relative when cancer was diagnosed
database_cross_reference: MONDO:0004992
internal ID: CancRelAgeDiagnosis_3

cancer
type: Axiom
annotated source: CancRelAgeDiagnosis_3
annotated property: database_cross_reference
annotated target: MONDO:0004992

CancRelSite_3
type: Class
subclass of: Cancer History
definition: Specifies the site of cancer in the relative of participant
database_cross_reference: MONDO:0004992
internal ID: CancRelSite_3

cancer
type: Axiom
annotated source: CancRelSite_3
annotated property: database_cross_reference
annotated target: MONDO:0004992

CancRelICD10_3
type: Class
subclass of: Cancer History
definition: Specifies the ICD-10 code of cancer in the relative of participant
database_cross_reference: MONDO:0004992
internal ID: CancRelICD10_3

cancer
type: Axiom
annotated source: CancRelICD10_3
annotated property: database_cross_reference
annotated target: MONDO:0004992

CancRelRelativeCode_4
type: Class
subclass of: Cancer History
definition: Specifies the additional relative of participants with a history of cancer
database_cross_reference: MONDO:0004992
internal ID: CancRelRelativeCode_4

cancer
type: Axiom
annotated source: CancRelRelativeCode_4
annotated property: database_cross_reference
annotated target: MONDO:0004992

CancRelAgeDiagnosis_4
type: Class
subclass of: Cancer History
definition: Specifies the age of relative when cancer was diagnosed
database_cross_reference: MONDO:0004992
internal ID: CancRelAgeDiagnosis_4

cancer
type: Axiom
annotated source: CancRelAgeDiagnosis_4
annotated property: database_cross_reference
annotated target: MONDO:0004992

CancRelSite_4
type: Class
subclass of: Cancer History
definition: Specifies the site of cancer in the relative of participant
database_cross_reference: MONDO:0004992
internal ID: CancRelSite_4

cancer
type: Axiom
annotated source: CancRelSite_4
annotated property: database_cross_reference
annotated target: MONDO:0004992

CancRelICD10_4
type: Class
subclass of: Cancer History
definition: Specifies the ICD-10 code of cancer in the relative of participant
database_cross_reference: MONDO:0004992
internal ID: CancRelICD10_4

cancer
type: Axiom
annotated source: CancRelICD10_4
annotated property: database_cross_reference
annotated target: MONDO:0004992

TobEverRegularFlag
type: Class
subclass of: Smoking
definition: Specifies the participant used cigar for 6 Months
database_cross_reference: GECKO:0000068
internal ID: TobEverRegularFlag

tobacco use history
type: Axiom
annotated source: TobEverRegularFlag
annotated property: database_cross_reference
annotated target: GECKO:0000068

TobCigsNow
type: Class
subclass of: Smoking
definition: Specifies the participant uses cigar Now
database_cross_reference: GECKO:0000068
internal ID: TobCigsNow

tobacco use history
type: Axiom
annotated source: TobCigsNow
annotated property: database_cross_reference
annotated target: GECKO:0000068

TobNonCigFlag
type: Class
subclass of: Smoking
definition: Specifies the participant used tobacco other than cigar for 6 Months
database_cross_reference: GECKO:0000068
internal ID: TobNonCigFlag

tobacco use history
type: Axiom
annotated source: TobNonCigFlag
annotated property: database_cross_reference
annotated target: GECKO:0000068

TobStartAge_1
type: Class
subclass of: Smoking
definition: Specifies the participant Used this Tobacco type From Age, first history
database_cross_reference: GECKO:0000068
internal ID: TobStartAge_1

tobacco use history
type: Axiom
annotated source: TobStartAge_1
annotated property: database_cross_reference
annotated target: GECKO:0000068

TobEndAge_1
type: Class
subclass of: Smoking
definition: Specifies the participant Used this Tobacco type To Age, first history
database_cross_reference: GECKO:0000068
internal ID: TobEndAge_1

tobacco use history
type: Axiom
annotated source: TobEndAge_1
annotated property: database_cross_reference
annotated target: GECKO:0000068

TobDuration_1
type: Class
subclass of: Smoking
definition: Specifies the participant Used tobacco Duration, first history
database_cross_reference: GECKO:0000068
internal ID: TobDuration_1

tobacco use history
type: Axiom
annotated source: TobDuration_1
annotated property: database_cross_reference
annotated target: GECKO:0000068

TobType_1
type: Class
subclass of: Smoking
definition: Specifies the participant Used type of Tobacco, first history
database_cross_reference: GECKO:0000068
internal ID: TobType_1

tobacco use history
type: Axiom
annotated source: TobType_1
annotated property: database_cross_reference
annotated target: GECKO:0000068

TobNumberPerDay_1
type: Class
subclass of: Smoking
definition: Specifies the participant Used this tobacco how many times per day, first history
database_cross_reference: GECKO:0000068
internal ID: TobNumberPerDay_1

tobacco use history
type: Axiom
annotated source: TobNumberPerDay_1
annotated property: database_cross_reference
annotated target: GECKO:0000068

TobDaysPerWeek_1
type: Class
subclass of: Smoking
definition: Specifies the participant Used this tobacco how many days in week, first history
database_cross_reference: GECKO:0000068
internal ID: TobDaysPerWeek_1

tobacco use history
type: Axiom
annotated source: TobDaysPerWeek_1
annotated property: database_cross_reference
annotated target: GECKO:0000068

CigNumPerDay_1
type: Class
subclass of: Smoking
definition: Specifies the participant Used this cigar how many times per day, first history
database_cross_reference: GECKO:0000068
internal ID: CigNumPerDay_1

tobacco use history
type: Axiom
annotated source: CigNumPerDay_1
annotated property: database_cross_reference
annotated target: GECKO:0000068

Cigpackyear_1
type: Class
subclass of: Smoking
definition: Specifies the participant cumulative use, first history
database_cross_reference: GECKO:0000068
internal ID: Cigpackyear_1

tobacco use history
type: Axiom
annotated source: Cigpackyear_1
annotated property: database_cross_reference
annotated target: GECKO:0000068

TobStartAge_2
type: Class
subclass of: Smoking
definition: Specifies the participant Used this Tobacco type From Age, second history
database_cross_reference: GECKO:0000068
internal ID: TobStartAge_2

tobacco use history
type: Axiom
annotated source: TobStartAge_2
annotated property: database_cross_reference
annotated target: GECKO:0000068

TobEndAge_2
type: Class
subclass of: Smoking
definition: Specifies the participant Used this Tobacco type To Age, second history
database_cross_reference: GECKO:0000068
internal ID: TobEndAge_2

tobacco use history
type: Axiom
annotated source: TobEndAge_2
annotated property: database_cross_reference
annotated target: GECKO:0000068

TobDuration_2
type: Class
subclass of: Smoking
definition: Specifies the participant Used tobacco Duration, second history
database_cross_reference: GECKO:0000068
internal ID: TobDuration_2

tobacco use history
type: Axiom
annotated source: TobDuration_2
annotated property: database_cross_reference
annotated target: GECKO:0000068

TobType_2
type: Class
subclass of: Smoking
definition: Specifies the participant Used type of Tobacco, second history
database_cross_reference: GECKO:0000068
internal ID: TobType_2

tobacco use history
type: Axiom
annotated source: TobType_2
annotated property: database_cross_reference
annotated target: GECKO:0000068

TobNumberPerDay_2
type: Class
subclass of: Smoking
definition: Specifies the participant Used this tobacco how many times per day, second history
database_cross_reference: GECKO:0000068
internal ID: TobNumberPerDay_2

tobacco use history
type: Axiom
annotated source: TobNumberPerDay_2
annotated property: database_cross_reference
annotated target: GECKO:0000068

TobDaysPerWeek_2
type: Class
subclass of: Smoking
definition: Specifies the participant Used this tobacco how many days in week, second history
database_cross_reference: GECKO:0000068
internal ID: TobDaysPerWeek_2

tobacco use history
type: Axiom
annotated source: TobDaysPerWeek_2
annotated property: database_cross_reference
annotated target: GECKO:0000068

CigNumPerDay_2
type: Class
subclass of: Smoking
definition: Specifies the participant Used this cigar how many times per day, second history
database_cross_reference: GECKO:0000068
internal ID: CigNumPerDay_2

tobacco use history
type: Axiom
annotated source: CigNumPerDay_2
annotated property: database_cross_reference
annotated target: GECKO:0000068

Cigpackyear_2
type: Class
subclass of: Smoking
definition: Specifies the participant cumulative use, second history
database_cross_reference: GECKO:0000068
internal ID: Cigpackyear_2

tobacco use history
type: Axiom
annotated source: Cigpackyear_2
annotated property: database_cross_reference
annotated target: GECKO:0000068

TobStartAge_3
type: Class
subclass of: Smoking
definition: Specifies the participant Used this Tobacco type From Age, third history
database_cross_reference: GECKO:0000068
internal ID: TobStartAge_3

tobacco use history
type: Axiom
annotated source: TobStartAge_3
annotated property: database_cross_reference
annotated target: GECKO:0000068

TobEndAge_3
type: Class
subclass of: Smoking
definition: Specifies the participant Used this Tobacco type To Age, third history
database_cross_reference: GECKO:0000068
internal ID: TobEndAge_3

tobacco use history
type: Axiom
annotated source: TobEndAge_3
annotated property: database_cross_reference
annotated target: GECKO:0000068

TobDuration_3
type: Class
subclass of: Smoking
definition: Specifies the participant Used tobacco Duration, third history
database_cross_reference: GECKO:0000068
internal ID: TobDuration_3

tobacco use history
type: Axiom
annotated source: TobDuration_3
annotated property: database_cross_reference
annotated target: GECKO:0000068

TobType_3
type: Class
subclass of: Smoking
definition: Specifies the participant Used type of Tobacco, third history
database_cross_reference: GECKO:0000068
internal ID: TobType_3

tobacco use history
type: Axiom
annotated source: TobType_3
annotated property: database_cross_reference
annotated target: GECKO:0000068

TobNumberPerDay_3
type: Class
subclass of: Smoking
definition: Specifies the participant Used this tobacco how many times per day, third history
database_cross_reference: GECKO:0000068
internal ID: TobNumberPerDay_3

tobacco use history
type: Axiom
annotated source: TobNumberPerDay_3
annotated property: database_cross_reference
annotated target: GECKO:0000068

TobDaysPerWeek_3
type: Class
subclass of: Smoking
definition: Specifies the participant Used this tobacco how many days in week, third history
database_cross_reference: GECKO:0000068
internal ID: TobDaysPerWeek_3

tobacco use history
type: Axiom
annotated source: TobDaysPerWeek_3
annotated property: database_cross_reference
annotated target: GECKO:0000068

CigNumPerDay_3
type: Class
subclass of: Smoking
definition: Specifies the participant Used this cigar how many times per day, third history
database_cross_reference: GECKO:0000068
internal ID: CigNumPerDay_3

tobacco use history
type: Axiom
annotated source: CigNumPerDay_3
annotated property: database_cross_reference
annotated target: GECKO:0000068

Cigpackyear_3
type: Class
subclass of: Smoking
definition: Specifies the participant cumulative use, third history
database_cross_reference: GECKO:0000068
internal ID: Cigpackyear_3

tobacco use history
type: Axiom
annotated source: Cigpackyear_3
annotated property: database_cross_reference
annotated target: GECKO:0000068

TobStartAge_4
type: Class
subclass of: Smoking
definition: Specifies the participant Used this Tobacco type From Age, fourth history
database_cross_reference: GECKO:0000068
internal ID: TobStartAge_4

tobacco use history
type: Axiom
annotated source: TobStartAge_4
annotated property: database_cross_reference
annotated target: GECKO:0000068

TobEndAge_4
type: Class
subclass of: Smoking
definition: Specifies the participant Used this Tobacco type To Age, fourth history
database_cross_reference: GECKO:0000068
internal ID: TobEndAge_4

tobacco use history
type: Axiom
annotated source: TobEndAge_4
annotated property: database_cross_reference
annotated target: GECKO:0000068

TobDuration_4
type: Class
subclass of: Smoking
definition: Specifies the participant Used tobacco Duration, fourth history
database_cross_reference: GECKO:0000068
internal ID: TobDuration_4

tobacco use history
type: Axiom
annotated source: TobDuration_4
annotated property: database_cross_reference
annotated target: GECKO:0000068

TobType_4
type: Class
subclass of: Smoking
definition: Specifies the participant Used type of Tobacco, fourth history
database_cross_reference: GECKO:0000068
internal ID: TobType_4

tobacco use history
type: Axiom
annotated source: TobType_4
annotated property: database_cross_reference
annotated target: GECKO:0000068

TobNumberPerDay_4
type: Class
subclass of: Smoking
definition: Specifies the participant Used this tobacco how many times per day, fourth history
database_cross_reference: GECKO:0000068
internal ID: TobNumberPerDay_4

tobacco use history
type: Axiom
annotated source: TobNumberPerDay_4
annotated property: database_cross_reference
annotated target: GECKO:0000068

TobDaysPerWeek_4
type: Class
subclass of: Smoking
definition: Specifies the participant Used this tobacco how many days in week, fourth history
database_cross_reference: GECKO:0000068
internal ID: TobDaysPerWeek_4

tobacco use history
type: Axiom
annotated source: TobDaysPerWeek_4
annotated property: database_cross_reference
annotated target: GECKO:0000068

CigNumPerDay_4
type: Class
subclass of: Smoking
definition: Specifies the participant Used this cigar how many times per day, fourth history
database_cross_reference: GECKO:0000068
internal ID: CigNumPerDay_4

tobacco use history
type: Axiom
annotated source: CigNumPerDay_4
annotated property: database_cross_reference
annotated target: GECKO:0000068

Cigpackyear_4
type: Class
subclass of: Smoking
definition: Specifies the participant cumulative use, fourth history
database_cross_reference: GECKO:0000068
internal ID: Cigpackyear_4

tobacco use history
type: Axiom
annotated source: Cigpackyear_4
annotated property: database_cross_reference
annotated target: GECKO:0000068

total_packyear
type: Class
subclass of: Smoking
definition: Specifies the participant total cumulative use
database_cross_reference: GECKO:0000068
internal ID: total_packyear

tobacco use history
type: Axiom
annotated source: total_packyear
annotated property: database_cross_reference
annotated target: GECKO:0000068

OpiateEverRegularFlag
type: Class
subclass of: Opium use
definition: Specifies the participant ever used opiume for 6 Months
database_cross_reference: GECKO:0000103
internal ID: OpiateEverRegularFlag

recreational drug history
type: Axiom
annotated source: OpiateEverRegularFlag
annotated property: database_cross_reference
annotated target: GECKO:0000103

OpiatePersonalChildhoodExp
type: Class
subclass of: Opium use
definition: Specifies the using opium in Childhood
database_cross_reference: GECKO:0000103
internal ID: OpiatePersonalChildhoodExp

recreational drug history
type: Axiom
annotated source: OpiatePersonalChildhoodExp
annotated property: database_cross_reference
annotated target: GECKO:0000103

OpiateAdministeredToChildrenFlag
type: Class
subclass of: Opium use
definition: Specifies the participant gave opium to children
database_cross_reference: GECKO:0000103
internal ID: OpiateAdministeredToChildrenFlag

recreational drug history
type: Axiom
annotated source: OpiateAdministeredToChildrenFlag
annotated property: database_cross_reference
annotated target: GECKO:0000103

OpiateType
type: Class
subclass of: Opium use
definition: Specifies the participant Used Opium type
database_cross_reference: GECKO:0000103
internal ID: OpiateType

recreational drug history
type: Axiom
annotated source: OpiateType
annotated property: database_cross_reference
annotated target: GECKO:0000103

OpiateRoute
type: Class
subclass of: Opium use
definition: Specifies the route by which participant uses opium
database_cross_reference: GECKO:0000103
internal ID: OpiateRoute

recreational drug history
type: Axiom
annotated source: OpiateRoute
annotated property: database_cross_reference
annotated target: GECKO:0000103

OpiateStartAge_1
type: Class
subclass of: Opium use
definition: Specifies the participant Used this Opium type From Age, first history
database_cross_reference: GECKO:0000103
internal ID: OpiateStartAge_1

recreational drug history
type: Axiom
annotated source: OpiateStartAge_1
annotated property: database_cross_reference
annotated target: GECKO:0000103

OpiateEndAge_1
type: Class
subclass of: Opium use
definition: Specifies the participant Used this Opium type To Age, first history
database_cross_reference: GECKO:0000103
internal ID: OpiateEndAge_1

recreational drug history
type: Axiom
annotated source: OpiateEndAge_1
annotated property: database_cross_reference
annotated target: GECKO:0000103

OpiateDuration_1
type: Class
subclass of: Opium use
definition: Specifies the participant Used this Opium Duration, first history
database_cross_reference: GECKO:0000103
internal ID: OpiateDuration_1

recreational drug history
type: Axiom
annotated source: OpiateDuration_1
annotated property: database_cross_reference
annotated target: GECKO:0000103

OpiateNokhod_1
type: Class
subclass of: Opium use
definition: Specifies the participant Used this Opium amount in Pea size, first history
database_cross_reference: GECKO:0000103
internal ID: OpiateNokhod_1

recreational drug history
type: Axiom
annotated source: OpiateNokhod_1
annotated property: database_cross_reference
annotated target: GECKO:0000103

OpiateDaysPerWeek_1
type: Class
subclass of: Opium use
definition: Specifies the participant Used this Opium day in week, first history
database_cross_reference: GECKO:0000103
internal ID: OpiateDaysPerWeek_1

recreational drug history
type: Axiom
annotated source: OpiateDaysPerWeek_1
annotated property: database_cross_reference
annotated target: GECKO:0000103

OpiateAmountperDay_1
type: Class
subclass of: Opium use
definition: Specifies the participant Used this Opium Amount per day, first history
database_cross_reference: GECKO:0000103
internal ID: OpiateAmountperDay_1

recreational drug history
type: Axiom
annotated source: OpiateAmountperDay_1
annotated property: database_cross_reference
annotated target: GECKO:0000103

Opiatecum_1
type: Class
subclass of: Opium use
definition: Specifies the participant cumulative use of Opium, first history
database_cross_reference: GECKO:0000103
internal ID: Opiatecum_1

recreational drug history
type: Axiom
annotated source: Opiatecum_1
annotated property: database_cross_reference
annotated target: GECKO:0000103

OpiateStartAge_2
type: Class
subclass of: Opium use
definition: Specifies the participant Used this Opium type From Age, second history
database_cross_reference: GECKO:0000103
internal ID: OpiateStartAge_2

recreational drug history
type: Axiom
annotated source: OpiateStartAge_2
annotated property: database_cross_reference
annotated target: GECKO:0000103

OpiateEndAge_2
type: Class
subclass of: Opium use
definition: Specifies the participant Used this Opium type To Age, second history
database_cross_reference: GECKO:0000103
internal ID: OpiateEndAge_2

recreational drug history
type: Axiom
annotated source: OpiateEndAge_2
annotated property: database_cross_reference
annotated target: GECKO:0000103

OpiateDuration_2
type: Class
subclass of: Opium use
definition: Specifies the participant Used this Opium Duration, second history
database_cross_reference: GECKO:0000103
internal ID: OpiateDuration_2

recreational drug history
type: Axiom
annotated source: OpiateDuration_2
annotated property: database_cross_reference
annotated target: GECKO:0000103

OpiateNokhod_2
type: Class
subclass of: Opium use
definition: Specifies the participant Used this Opium amount in Pea size, second history
database_cross_reference: GECKO:0000103
internal ID: OpiateNokhod_2

recreational drug history
type: Axiom
annotated source: OpiateNokhod_2
annotated property: database_cross_reference
annotated target: GECKO:0000103

OpiateDaysPerWeek_2
type: Class
subclass of: Opium use
definition: Specifies the participant Used this Opium day in week, second history
database_cross_reference: GECKO:0000103
internal ID: OpiateDaysPerWeek_2

recreational drug history
type: Axiom
annotated source: OpiateDaysPerWeek_2
annotated property: database_cross_reference
annotated target: GECKO:0000103

OpiateAmountperDay_2
type: Class
subclass of: Opium use
definition: Specifies the participant Used this Opium Amount per day, second history
database_cross_reference: GECKO:0000103
internal ID: OpiateAmountperDay_2

recreational drug history
type: Axiom
annotated source: OpiateAmountperDay_2
annotated property: database_cross_reference
annotated target: GECKO:0000103

Opiatecum_2
type: Class
subclass of: Opium use
definition: Specifies the participant cumulative use of Opium, second history
database_cross_reference: GECKO:0000103
internal ID: Opiatecum_2

recreational drug history
type: Axiom
annotated source: Opiatecum_2
annotated property: database_cross_reference
annotated target: GECKO:0000103

OpiateStartAge_3
type: Class
subclass of: Opium use
definition: Specifies the participant Used this Opium type From Age, third history
database_cross_reference: GECKO:0000103
internal ID: OpiateStartAge_3

recreational drug history
type: Axiom
annotated source: OpiateStartAge_3
annotated property: database_cross_reference
annotated target: GECKO:0000103

OpiateEndAge_3
type: Class
subclass of: Opium use
definition: Specifies the participant Used this Opium type To Age, third history
database_cross_reference: GECKO:0000103
internal ID: OpiateEndAge_3

recreational drug history
type: Axiom
annotated source: OpiateEndAge_3
annotated property: database_cross_reference
annotated target: GECKO:0000103

OpiateDuration_3
type: Class
subclass of: Opium use
definition: Specifies the participant Used this Opium Duration, third history
database_cross_reference: GECKO:0000103
internal ID: OpiateDuration_3

recreational drug history
type: Axiom
annotated source: OpiateDuration_3
annotated property: database_cross_reference
annotated target: GECKO:0000103

OpiateNokhod_3
type: Class
subclass of: Opium use
definition: Specifies the participant Used this Opium amount in Pea size, third history
database_cross_reference: GECKO:0000103
internal ID: OpiateNokhod_3

recreational drug history
type: Axiom
annotated source: OpiateNokhod_3
annotated property: database_cross_reference
annotated target: GECKO:0000103

OpiateDaysPerWeek_3
type: Class
subclass of: Opium use
definition: Specifies the participant Used this Opium day in week, third history
database_cross_reference: GECKO:0000103
internal ID: OpiateDaysPerWeek_3

recreational drug history
type: Axiom
annotated source: OpiateDaysPerWeek_3
annotated property: database_cross_reference
annotated target: GECKO:0000103

OpiateAmountperDay_3
type: Class
subclass of: Opium use
definition: Specifies the participant Used this Opium Amount per day, third history
database_cross_reference: GECKO:0000103
internal ID: OpiateAmountperDay_3

recreational drug history
type: Axiom
annotated source: OpiateAmountperDay_3
annotated property: database_cross_reference
annotated target: GECKO:0000103

Opiatecum_3
type: Class
subclass of: Opium use
definition: Specifies the participant cumulative use of Opium, third history
database_cross_reference: GECKO:0000103
internal ID: Opiatecum_3

recreational drug history
type: Axiom
annotated source: Opiatecum_3
annotated property: database_cross_reference
annotated target: GECKO:0000103

OpiateStartAge_4
type: Class
subclass of: Opium use
definition: Specifies the participant Used this Opium type From Age, fourth history
database_cross_reference: GECKO:0000103
internal ID: OpiateStartAge_4

recreational drug history
type: Axiom
annotated source: OpiateStartAge_4
annotated property: database_cross_reference
annotated target: GECKO:0000103

OpiateEndAge_4
type: Class
subclass of: Opium use
definition: Specifies the participant Used this Opium type To Age, fourth history
database_cross_reference: GECKO:0000103
internal ID: OpiateEndAge_4

recreational drug history
type: Axiom
annotated source: OpiateEndAge_4
annotated property: database_cross_reference
annotated target: GECKO:0000103

OpiateDuration_4
type: Class
subclass of: Opium use
definition: Specifies the participant Used this Opium Duration, fourth history
database_cross_reference: GECKO:0000103
internal ID: OpiateDuration_4

recreational drug history
type: Axiom
annotated source: OpiateDuration_4
annotated property: database_cross_reference
annotated target: GECKO:0000103

OpiateNokhod_4
type: Class
subclass of: Opium use
definition: Specifies the participant Used this Opium amount in Pea size, fourth history
database_cross_reference: GECKO:0000103
internal ID: OpiateNokhod_4

recreational drug history
type: Axiom
annotated source: OpiateNokhod_4
annotated property: database_cross_reference
annotated target: GECKO:0000103

OpiateDaysPerWeek_4
type: Class
subclass of: Opium use
definition: Specifies the participant Used this Opium day in week, fourth history
database_cross_reference: GECKO:0000103
internal ID: OpiateDaysPerWeek_4

recreational drug history
type: Axiom
annotated source: OpiateDaysPerWeek_4
annotated property: database_cross_reference
annotated target: GECKO:0000103

OpiateAmountperDay_4
type: Class
subclass of: Opium use
definition: Specifies the participant Used this Opium Amount per day, fourth history
database_cross_reference: GECKO:0000103
internal ID: OpiateAmountperDay_4

recreational drug history
type: Axiom
annotated source: OpiateAmountperDay_4
annotated property: database_cross_reference
annotated target: GECKO:0000103

Opiatecum_4
type: Class
subclass of: Opium use
definition: Specifies the participant cumulative use of Opium, fourth history
database_cross_reference: GECKO:0000103
internal ID: Opiatecum_4

recreational drug history
type: Axiom
annotated source: Opiatecum_4
annotated property: database_cross_reference
annotated target: GECKO:0000103

TotalNokhodDay
type: Class
subclass of: Opium use
definition: Specifies the participant total cumulative use of Opium
database_cross_reference: GECKO:0000103
internal ID: TotalNokhodDay

recreational drug history
type: Axiom
annotated source: TotalNokhodDay
annotated property: database_cross_reference
annotated target: GECKO:0000103

AlcEverRegularFlag
type: Class
subclass of: Alcohol use
definition: Specifies the participant ever used alcohol for 6 Months
database_cross_reference: GECKO:0000069
internal ID: AlcEverRegularFlag

alcohol use history
type: Axiom
annotated source: AlcEverRegularFlag
annotated property: database_cross_reference
annotated target: GECKO:0000069

AlcStartAge_1
type: Class
subclass of: Alcohol use
definition: Specifies the participant used alcohol From Age, first history
database_cross_reference: GECKO:0000069
internal ID: AlcStartAge_1

alcohol use history
type: Axiom
annotated source: AlcStartAge_1
annotated property: database_cross_reference
annotated target: GECKO:0000069

AlcEndAge_1
type: Class
subclass of: Alcohol use
definition: Specifies the participant used alcohol To Age, first history
database_cross_reference: GECKO:0000069
internal ID: AlcEndAge_1

alcohol use history
type: Axiom
annotated source: AlcEndAge_1
annotated property: database_cross_reference
annotated target: GECKO:0000069

AlcType_1
type: Class
subclass of: Alcohol use
definition: Specifies the participant alcohol used Type, first history
database_cross_reference: GECKO:0000069
internal ID: AlcType_1

alcohol use history
type: Axiom
annotated source: AlcType_1
annotated property: database_cross_reference
annotated target: GECKO:0000069

AlcQuantityPerEpisode_1
type: Class
subclass of: Alcohol use
definition: Specifies the average alcohol the participant used per episode, first history
database_cross_reference: GECKO:0000069
internal ID: AlcQuantityPerEpisode_1

alcohol use history
type: Axiom
annotated source: AlcQuantityPerEpisode_1
annotated property: database_cross_reference
annotated target: GECKO:0000069

AlcEpisodesPerMonth_1
type: Class
subclass of: Alcohol use
definition: Specifies the participant Alcohol episodes in month, first history
database_cross_reference: GECKO:0000069
internal ID: AlcEpisodesPerMonth_1

alcohol use history
type: Axiom
annotated source: AlcEpisodesPerMonth_1
annotated property: database_cross_reference
annotated target: GECKO:0000069

AlcStartAge_2
type: Class
subclass of: Alcohol use
definition: Specifies the participant used alcohol From Age, second history
database_cross_reference: GECKO:0000069
internal ID: AlcStartAge_2

alcohol use history
type: Axiom
annotated source: AlcStartAge_2
annotated property: database_cross_reference
annotated target: GECKO:0000069

AlcEndAge_2
type: Class
subclass of: Alcohol use
definition: Specifies the participant used alcohol To Age, second history
database_cross_reference: GECKO:0000069
internal ID: AlcEndAge_2

alcohol use history
type: Axiom
annotated source: AlcEndAge_2
annotated property: database_cross_reference
annotated target: GECKO:0000069

AlcType_2
type: Class
subclass of: Alcohol use
definition: Specifies the participant alcohol used Type, second history
database_cross_reference: GECKO:0000069
internal ID: AlcType_2

alcohol use history
type: Axiom
annotated source: AlcType_2
annotated property: database_cross_reference
annotated target: GECKO:0000069

AlcQuantityPerEpisode_2
type: Class
subclass of: Alcohol use
definition: Specifies the average alcohol the participant used per episode, second history
database_cross_reference: GECKO:0000069
internal ID: AlcQuantityPerEpisode_2

alcohol use history
type: Axiom
annotated source: AlcQuantityPerEpisode_2
annotated property: database_cross_reference
annotated target: GECKO:0000069

AlcEpisodesPerMonth_2
type: Class
subclass of: Alcohol use
definition: Specifies the participant Alcohol episodes in month, second history
database_cross_reference: GECKO:0000069
internal ID: AlcEpisodesPerMonth_2

alcohol use history
type: Axiom
annotated source: AlcEpisodesPerMonth_2
annotated property: database_cross_reference
annotated target: GECKO:0000069

AlcStartAge_3
type: Class
subclass of: Alcohol use
definition: Specifies the participant used alcohol From Age, third history
database_cross_reference: GECKO:0000069
internal ID: AlcStartAge_3

alcohol use history
type: Axiom
annotated source: AlcStartAge_3
annotated property: database_cross_reference
annotated target: GECKO:0000069

AlcEndAge_3
type: Class
subclass of: Alcohol use
definition: Specifies the participant used alcohol To Age, third history
database_cross_reference: GECKO:0000069
internal ID: AlcEndAge_3

alcohol use history
type: Axiom
annotated source: AlcEndAge_3
annotated property: database_cross_reference
annotated target: GECKO:0000069

AlcType_3
type: Class
subclass of: Alcohol use
definition: Specifies the participant alcohol used Type, third history
database_cross_reference: GECKO:0000069
internal ID: AlcType_3

alcohol use history
type: Axiom
annotated source: AlcType_3
annotated property: database_cross_reference
annotated target: GECKO:0000069

AlcQuantityPerEpisode_3
type: Class
subclass of: Alcohol use
definition: Specifies the average alcohol the participant used per episode, third history
database_cross_reference: GECKO:0000069
internal ID: AlcQuantityPerEpisode_3

alcohol use history
type: Axiom
annotated source: AlcQuantityPerEpisode_3
annotated property: database_cross_reference
annotated target: GECKO:0000069

AlcEpisodesPerMonth_3
type: Class
subclass of: Alcohol use
definition: Specifies the participant Alcohol episodes in month, third history
database_cross_reference: GECKO:0000069
internal ID: AlcEpisodesPerMonth_3

alcohol use history
type: Axiom
annotated source: AlcEpisodesPerMonth_3
annotated property: database_cross_reference
annotated target: GECKO:0000069

DrugCurrentuse
type: Class
subclass of: Drug history (1)
definition: Currently taking any medication?
database_cross_reference: GECKO:0000093
internal ID: DrugCurrentuse

medication
type: Axiom
annotated source: DrugCurrentuse
annotated property: database_cross_reference
annotated target: GECKO:0000093

antiHTN
type: Class
subclass of: Drug history (1)
definition: Anti-hypertensive drugs: 1: diuretics 2: beta-blockers 3: ACE Inhibitors 4: ARBs 5: Alpha-adrenergic blockers 6: Calcium channel blockers 7:other anti-hypertensives
database_cross_reference: GECKO:0000094
internal ID: antiHTN

associated disease(s)
type: Axiom
annotated source: antiHTN
annotated property: database_cross_reference
annotated target: GECKO:0000094

antiDM
type: Class
subclass of: Drug history (1)
definition: Anti-diabetic drugs: 1: Glibenclamide 2: metformin 3: insulin 4: other
database_cross_reference: GECKO:0000094
internal ID: antiDM

associated disease(s)
type: Axiom
annotated source: antiDM
annotated property: database_cross_reference
annotated target: GECKO:0000094

cardiac
type: Class
subclass of: Drug history (1)
definition: Cardiac drugs: 1: Anti-platelets 2: statins 3: Beta-blockers 4: Nitrates 5: ACE Inhibitors 6: ARBs 7: Calcium Channel blockers 8: other
database_cross_reference: GECKO:0000094
internal ID: cardiac

associated disease(s)
type: Axiom
annotated source: cardiac
annotated property: database_cross_reference
annotated target: GECKO:0000094

antilipid
type: Class
subclass of: Drug history (1)
definition: Lipid-lowering drugs: 1: Statins 2: Gemfibrozil 3: other
database_cross_reference: GECKO:0000094
internal ID: antilipid

associated disease(s)
type: Axiom
annotated source: antilipid
annotated property: database_cross_reference
annotated target: GECKO:0000094

mentaldrug
type: Class
subclass of: Drug history (1)
definition: Mental disorders: 1: Benzodiazepines 2: Sodium Valproate 3: Anti-epileptics 4: Antidepressants 5: Anti-anxiety medications 6: Psychoactive medications
database_cross_reference: GECKO:0000094
internal ID: mentaldrug

associated disease(s)
type: Axiom
annotated source: mentaldrug
annotated property: database_cross_reference
annotated target: GECKO:0000094

Corticosteroid
type: Class
subclass of: Drug history (1)
definition: Corticosteroids: 1: injection 2: oral 3: topical
database_cross_reference: PDRO:0000024
internal ID: Corticosteroid

prescription
type: Axiom
annotated source: Corticosteroid
annotated property: database_cross_reference
annotated target: PDRO:0000024

Gidrugs
type: Class
subclass of: Drug history (1)
definition: Gastrointestinal: 1: H2 Blockers 2: PPIs 3: Clindinium C
database_cross_reference: GECKO:0000094
internal ID: Gidrugs

associated disease(s)
type: Axiom
annotated source: Gidrugs
annotated property: database_cross_reference
annotated target: GECKO:0000094

antibiotics
type: Class
subclass of: Drug history (1)
definition: Antibiotics: 1: Amoxicillin 2: Cefixime 3: Azithromycin 4: Metronidazole 5: other
database_cross_reference: PDRO:0000024
internal ID: antibiotics

prescription
type: Axiom
annotated source: antibiotics
annotated property: database_cross_reference
annotated target: PDRO:0000024

diuretic
type: Class
subclass of: Drug history (1)
definition: Diuretics
database_cross_reference: PDRO:0000024
internal ID: diuretic

prescription
type: Axiom
annotated source: diuretic
annotated property: database_cross_reference
annotated target: PDRO:0000024

betablocker
type: Class
subclass of: Drug history (1)
definition: Beta Blockers
database_cross_reference: PDRO:0000024
internal ID: betablocker

prescription
type: Axiom
annotated source: betablocker
annotated property: database_cross_reference
annotated target: PDRO:0000024

ACEinhibitor
type: Class
subclass of: Drug history (1)
definition: Angiotensin Converting Enzyme Inhibitors
database_cross_reference: PDRO:0000024
internal ID: ACEinhibitor

prescription
type: Axiom
annotated source: ACEinhibitor
annotated property: database_cross_reference
annotated target: PDRO:0000024

ARB
type: Class
subclass of: Drug history (1)
definition: Angiotensin Receptor Blockers
database_cross_reference: PDRO:0000024
internal ID: ARB

prescription
type: Axiom
annotated source: ARB
annotated property: database_cross_reference
annotated target: PDRO:0000024

alphablocker
type: Class
subclass of: Drug history (1)
definition: Alpha Adrenergic Blockers
database_cross_reference: PDRO:0000024
internal ID: alphablocker

prescription
type: Axiom
annotated source: alphablocker
annotated property: database_cross_reference
annotated target: PDRO:0000024

CCBlocker
type: Class
subclass of: Drug history (1)
definition: Calcium Channel Blockers
database_cross_reference: PDRO:0000024
internal ID: CCBlocker

prescription
type: Axiom
annotated source: CCBlocker
annotated property: database_cross_reference
annotated target: PDRO:0000024

Glibenclamide
type: Class
subclass of: Drug history (1)
definition: Glibenclamide
database_cross_reference: PDRO:0000024
internal ID: Glibenclamide

prescription
type: Axiom
annotated source: Glibenclamide
annotated property: database_cross_reference
annotated target: PDRO:0000024

Metformin
type: Class
subclass of: Drug history (1)
definition: Metformin
database_cross_reference: PDRO:0000024
internal ID: Metformin

prescription
type: Axiom
annotated source: Metformin
annotated property: database_cross_reference
annotated target: PDRO:0000024

Insulin
type: Class
subclass of: Drug history (1)
definition: Insulin
database_cross_reference: PDRO:0000024
internal ID: Insulin

prescription
type: Axiom
annotated source: Insulin
annotated property: database_cross_reference
annotated target: PDRO:0000024

Antiplatelets
type: Class
subclass of: Drug history (1)
definition: Anti-platelets
database_cross_reference: PDRO:0000024
internal ID: Antiplatelets

prescription
type: Axiom
annotated source: Antiplatelets
annotated property: database_cross_reference
annotated target: PDRO:0000024

Statins
type: Class
subclass of: Drug history (1)
definition: Statins
database_cross_reference: PDRO:0000024
internal ID: Statins

prescription
type: Axiom
annotated source: Statins
annotated property: database_cross_reference
annotated target: PDRO:0000024

Nitrates
type: Class
subclass of: Drug history (1)
definition: Nitrates
database_cross_reference: PDRO:0000024
internal ID: Nitrates

prescription
type: Axiom
annotated source: Nitrates
annotated property: database_cross_reference
annotated target: PDRO:0000024

Gemfibrozil
type: Class
subclass of: Drug history (1)
definition: Gemfibrozil
database_cross_reference: PDRO:0000024
internal ID: Gemfibrozil

prescription
type: Axiom
annotated source: Gemfibrozil
annotated property: database_cross_reference
annotated target: PDRO:0000024

Acetaminophen
type: Class
subclass of: Drug history (1)
definition: Acetaminophen and Acetaminophen Codein
database_cross_reference: PDRO:0000024
internal ID: Acetaminophen

prescription
type: Axiom
annotated source: Acetaminophen
annotated property: database_cross_reference
annotated target: PDRO:0000024

Ibuprofen
type: Class
subclass of: Drug history (1)
definition: Ibuprofen
database_cross_reference: PDRO:0000024
internal ID: Ibuprofen

prescription
type: Axiom
annotated source: Ibuprofen
annotated property: database_cross_reference
annotated target: PDRO:0000024

Diclophenac
type: Class
subclass of: Drug history (1)
definition: Diclophenac
database_cross_reference: PDRO:0000024
internal ID: Diclophenac

prescription
type: Axiom
annotated source: Diclophenac
annotated property: database_cross_reference
annotated target: PDRO:0000024

Indomethacin
type: Class
subclass of: Drug history (1)
definition: Indomethacin
database_cross_reference: PDRO:0000024
internal ID: Indomethacin

prescription
type: Axiom
annotated source: Indomethacin
annotated property: database_cross_reference
annotated target: PDRO:0000024

Levothyroxin
type: Class
subclass of: Drug history (1)
definition: Levthyroxin
database_cross_reference: PDRO:0000024
internal ID: Levothyroxin

prescription
type: Axiom
annotated source: Levothyroxin
annotated property: database_cross_reference
annotated target: PDRO:0000024

Methotrexate
type: Class
subclass of: Drug history (1)
definition: Methotrexate
database_cross_reference: PDRO:0000024
internal ID: Methotrexate

prescription
type: Axiom
annotated source: Methotrexate
annotated property: database_cross_reference
annotated target: PDRO:0000024

Other
type: Class
subclass of: Drug history (1)
definition: Other
database_cross_reference: GECKO:0000093
internal ID: Other

medication
type: Axiom
annotated source: Other
annotated property: database_cross_reference
annotated target: GECKO:0000093

DrugCurrentuse
type: Class
subclass of: Drug History (2)
definition: Currently taking any medication?
database_cross_reference: GECKO:0000093
internal ID: DrugCurrentuse

medication
type: Axiom
annotated source: DrugCurrentuse
annotated property: database_cross_reference
annotated target: GECKO:0000093

drugname_1
type: Class
subclass of: Drug History (2)
definition: Name of drug 1
database_cross_reference: PDRO:0000024
internal ID: drugname_1

prescription
type: Axiom
annotated source: drugname_1
annotated property: database_cross_reference
annotated target: PDRO:0000024

drugduration_1
type: Class
subclass of: Drug History (2)
definition: Number of years being under treatment 1
database_cross_reference: PDRO:0000024
internal ID: drugduration_1

prescription
type: Axiom
annotated source: drugduration_1
annotated property: database_cross_reference
annotated target: PDRO:0000024

drugfrequency_1
type: Class
subclass of: Drug History (2)
definition: Frequency of drug consumption 1
database_cross_reference: PDRO:0000024
internal ID: drugfrequency_1

prescription
type: Axiom
annotated source: drugfrequency_1
annotated property: database_cross_reference
annotated target: PDRO:0000024

drugdose_1
type: Class
subclass of: Drug History (2)
definition: Dose of drug consumed 1
database_cross_reference: PDRO:0000024
internal ID: drugdose_1

prescription
type: Axiom
annotated source: drugdose_1
annotated property: database_cross_reference
annotated target: PDRO:0000024

drugname_2
type: Class
subclass of: Drug History (2)
definition: Name of drug 2
database_cross_reference: PDRO:0000024
internal ID: drugname_2

prescription
type: Axiom
annotated source: drugname_2
annotated property: database_cross_reference
annotated target: PDRO:0000024

drugduration_2
type: Class
subclass of: Drug History (2)
definition: Number of years being under treatment 2
database_cross_reference: PDRO:0000024
internal ID: drugduration_2

prescription
type: Axiom
annotated source: drugduration_2
annotated property: database_cross_reference
annotated target: PDRO:0000024

drugfrequency_2
type: Class
subclass of: Drug History (2)
definition: Frequency of drug consumption 2
database_cross_reference: PDRO:0000024
internal ID: drugfrequency_2

prescription
type: Axiom
annotated source: drugfrequency_2
annotated property: database_cross_reference
annotated target: PDRO:0000024

drugdose_2
type: Class
subclass of: Drug History (2)
definition: Dose of drug consumed 2
database_cross_reference: PDRO:0000024
internal ID: drugdose_2

prescription
type: Axiom
annotated source: drugdose_2
annotated property: database_cross_reference
annotated target: PDRO:0000024

drugname_3
type: Class
subclass of: Drug History (2)
definition: Name of drug 3
database_cross_reference: PDRO:0000024
internal ID: drugname_3

prescription
type: Axiom
annotated source: drugname_3
annotated property: database_cross_reference
annotated target: PDRO:0000024

drugduration_3
type: Class
subclass of: Drug History (2)
definition: Number of years being under treatment 3
database_cross_reference: PDRO:0000024
internal ID: drugduration_3

prescription
type: Axiom
annotated source: drugduration_3
annotated property: database_cross_reference
annotated target: PDRO:0000024

drugfrequency_3
type: Class
subclass of: Drug History (2)
definition: Frequency of drug consumption 3
database_cross_reference: PDRO:0000024
internal ID: drugfrequency_3

prescription
type: Axiom
annotated source: drugfrequency_3
annotated property: database_cross_reference
annotated target: PDRO:0000024

drugdose_3
type: Class
subclass of: Drug History (2)
definition: Dose of drug consumed 3
database_cross_reference: PDRO:0000024
internal ID: drugdose_3

prescription
type: Axiom
annotated source: drugdose_3
annotated property: database_cross_reference
annotated target: PDRO:0000024

drugname_4
type: Class
subclass of: Drug History (2)
definition: Name of drug 4
database_cross_reference: PDRO:0000024
internal ID: drugname_4

prescription
type: Axiom
annotated source: drugname_4
annotated property: database_cross_reference
annotated target: PDRO:0000024

drugduration_4
type: Class
subclass of: Drug History (2)
definition: Number of years being under treatment 4
database_cross_reference: PDRO:0000024
internal ID: drugduration_4

prescription
type: Axiom
annotated source: drugduration_4
annotated property: database_cross_reference
annotated target: PDRO:0000024

drugfrequency_4
type: Class
subclass of: Drug History (2)
definition: Frequency of drug consumption 4
database_cross_reference: PDRO:0000024
internal ID: drugfrequency_4

prescription
type: Axiom
annotated source: drugfrequency_4
annotated property: database_cross_reference
annotated target: PDRO:0000024

drugdose_4
type: Class
subclass of: Drug History (2)
definition: Dose of drug consumed 4
database_cross_reference: PDRO:0000024
internal ID: drugdose_4

prescription
type: Axiom
annotated source: drugdose_4
annotated property: database_cross_reference
annotated target: PDRO:0000024

drugname_5
type: Class
subclass of: Drug History (2)
definition: Name of drug 5
database_cross_reference: PDRO:0000024
internal ID: drugname_5

prescription
type: Axiom
annotated source: drugname_5
annotated property: database_cross_reference
annotated target: PDRO:0000024

drugduration_5
type: Class
subclass of: Drug History (2)
definition: Number of years being under treatment 5
database_cross_reference: PDRO:0000024
internal ID: drugduration_5

prescription
type: Axiom
annotated source: drugduration_5
annotated property: database_cross_reference
annotated target: PDRO:0000024

drugfrequency_5
type: Class
subclass of: Drug History (2)
definition: Frequency of drug consumption 5
database_cross_reference: PDRO:0000024
internal ID: drugfrequency_5

prescription
type: Axiom
annotated source: drugfrequency_5
annotated property: database_cross_reference
annotated target: PDRO:0000024

drugdose_5
type: Class
subclass of: Drug History (2)
definition: Dose of drug consumed 5
database_cross_reference: PDRO:0000024
internal ID: drugdose_5

prescription
type: Axiom
annotated source: drugdose_5
annotated property: database_cross_reference
annotated target: PDRO:0000024

drugname_6
type: Class
subclass of: Drug History (2)
definition: Name of drug 6
database_cross_reference: PDRO:0000024
internal ID: drugname_6

prescription
type: Axiom
annotated source: drugname_6
annotated property: database_cross_reference
annotated target: PDRO:0000024

drugduration_6
type: Class
subclass of: Drug History (2)
definition: Number of years being under treatment 6
database_cross_reference: PDRO:0000024
internal ID: drugduration_6

prescription
type: Axiom
annotated source: drugduration_6
annotated property: database_cross_reference
annotated target: PDRO:0000024

drugfrequency_6
type: Class
subclass of: Drug History (2)
definition: Frequency of drug consumption 6
database_cross_reference: PDRO:0000024
internal ID: drugfrequency_6

prescription
type: Axiom
annotated source: drugfrequency_6
annotated property: database_cross_reference
annotated target: PDRO:0000024

drugdose_6
type: Class
subclass of: Drug History (2)
definition: Dose of drug consumed 6
database_cross_reference: PDRO:0000024
internal ID: drugdose_6

prescription
type: Axiom
annotated source: drugdose_6
annotated property: database_cross_reference
annotated target: PDRO:0000024

drugname_7
type: Class
subclass of: Drug History (2)
definition: Name of drug 7
database_cross_reference: PDRO:0000024
internal ID: drugname_7

prescription
type: Axiom
annotated source: drugname_7
annotated property: database_cross_reference
annotated target: PDRO:0000024

drugduration_7
type: Class
subclass of: Drug History (2)
definition: Number of years being under treatment 7
database_cross_reference: PDRO:0000024
internal ID: drugduration_7

prescription
type: Axiom
annotated source: drugduration_7
annotated property: database_cross_reference
annotated target: PDRO:0000024

drugfrequency_7
type: Class
subclass of: Drug History (2)
definition: Frequency of drug consumption 7
database_cross_reference: PDRO:0000024
internal ID: drugfrequency_7

prescription
type: Axiom
annotated source: drugfrequency_7
annotated property: database_cross_reference
annotated target: PDRO:0000024

drugdose_7
type: Class
subclass of: Drug History (2)
definition: Dose of drug consumed 7
database_cross_reference: PDRO:0000024
internal ID: drugdose_7

prescription
type: Axiom
annotated source: drugdose_7
annotated property: database_cross_reference
annotated target: PDRO:0000024

drugname_8
type: Class
subclass of: Drug History (2)
definition: Name of drug 8
database_cross_reference: PDRO:0000024
internal ID: drugname_8

prescription
type: Axiom
annotated source: drugname_8
annotated property: database_cross_reference
annotated target: PDRO:0000024

drugduration_8
type: Class
subclass of: Drug History (2)
definition: Number of years being under treatment 8
database_cross_reference: PDRO:0000024
internal ID: drugduration_8

prescription
type: Axiom
annotated source: drugduration_8
annotated property: database_cross_reference
annotated target: PDRO:0000024

drugfrequency_8
type: Class
subclass of: Drug History (2)
definition: Frequency of drug consumption 8
database_cross_reference: PDRO:0000024
internal ID: drugfrequency_8

prescription
type: Axiom
annotated source: drugfrequency_8
annotated property: database_cross_reference
annotated target: PDRO:0000024

drugdose_8
type: Class
subclass of: Drug History (2)
definition: Dose of drug consumed 8
database_cross_reference: PDRO:0000024
internal ID: drugdose_8

prescription
type: Axiom
annotated source: drugdose_8
annotated property: database_cross_reference
annotated target: PDRO:0000024

drugname_9
type: Class
subclass of: Drug History (2)
definition: Name of drug 9
database_cross_reference: PDRO:0000024
internal ID: drugname_9

prescription
type: Axiom
annotated source: drugname_9
annotated property: database_cross_reference
annotated target: PDRO:0000024

drugduration_9
type: Class
subclass of: Drug History (2)
definition: Number of years being under treatment 9
database_cross_reference: PDRO:0000024
internal ID: drugduration_9

prescription
type: Axiom
annotated source: drugduration_9
annotated property: database_cross_reference
annotated target: PDRO:0000024

drugfrequency_9
type: Class
subclass of: Drug History (2)
definition: Frequency of drug consumption 9
database_cross_reference: PDRO:0000024
internal ID: drugfrequency_9

prescription
type: Axiom
annotated source: drugfrequency_9
annotated property: database_cross_reference
annotated target: PDRO:0000024

drugdose_9
type: Class
subclass of: Drug History (2)
definition: Dose of drug consumed 9
database_cross_reference: PDRO:0000024
internal ID: drugdose_9

prescription
type: Axiom
annotated source: drugdose_9
annotated property: database_cross_reference
annotated target: PDRO:0000024

drugname_10
type: Class
subclass of: Drug History (2)
definition: Name of drug 10
database_cross_reference: PDRO:0000024
internal ID: drugname_10

prescription
type: Axiom
annotated source: drugname_10
annotated property: database_cross_reference
annotated target: PDRO:0000024

drugduration_10
type: Class
subclass of: Drug History (2)
definition: Number of years being under treatment 10
database_cross_reference: PDRO:0000024
internal ID: drugduration_10

prescription
type: Axiom
annotated source: drugduration_10
annotated property: database_cross_reference
annotated target: PDRO:0000024

drugfrequency_10
type: Class
subclass of: Drug History (2)
definition: Frequency of drug consumption 10
database_cross_reference: PDRO:0000024
internal ID: drugfrequency_10

prescription
type: Axiom
annotated source: drugfrequency_10
annotated property: database_cross_reference
annotated target: PDRO:0000024

drugdose_10
type: Class
subclass of: Drug History (2)
definition: Dose of drug consumed 10
database_cross_reference: PDRO:0000024
internal ID: drugdose_10

prescription
type: Axiom
annotated source: drugdose_10
annotated property: database_cross_reference
annotated target: PDRO:0000024

OralPermanentTeethLossFlag
type: Class
subclass of: Oral health
definition: Permanent Teeth Loss
internal ID: OralPermanentTeethLossFlag

OralPermanentTeethAgeFirstLoss
type: Class
subclass of: Oral health
definition: Specifies the age of first Permanent Teeth Loss
internal ID: OralPermanentTeethAgeFirstLoss

OralUpperDentureFlag
type: Class
subclass of: Oral health
definition: Specifies the participant used Upper Denture
internal ID: OralUpperDentureFlag

OralLowerDentureFlag
type: Class
subclass of: Oral health
definition: Specifies the participant used Lower Denture
internal ID: OralLowerDentureFlag

OralUpperDentureUse
type: Class
subclass of: Oral health
definition: Specifies the participant used Upper Denture during the day
internal ID: OralUpperDentureUse

OralLowerDentureUse
type: Class
subclass of: Oral health
definition: Specifies the participant used Lower Denture during the day
internal ID: OralLowerDentureUse

OralAgeDentureUpper
type: Class
subclass of: Oral health
definition: Specifies the age of participant first used Upper Denture
internal ID: OralAgeDentureUpper

OralAgeDentureLower
type: Class
subclass of: Oral health
definition: Specifies the age of participant First used Lower Denture
internal ID: OralAgeDentureLower

OralFreqBrushing
type: Class
subclass of: Oral health
definition: Specifies the participant Brushing Frequency
internal ID: OralFreqBrushing

OralFoodDiscomfortFlag
type: Class
subclass of: Oral health
definition: Specifies the frequency the participant experienced discomfort while eating food in Past Year
internal ID: OralFoodDiscomfortFlag

OralFoodDiscomfortType
type: Class
subclass of: Oral health
definition: Specifies the food that caused discomfort for the participant
internal ID: OralFoodDiscomfortType

OralNumTeeth
type: Class
subclass of: Oral health
definition: Specifies the participant Total number of teeth
internal ID: OralNumTeeth

OralNumTeethDecayed
type: Class
subclass of: Oral health
definition: Specifies the participant Total number of Decayed teeth
internal ID: OralNumTeethDecayed

OralNumTeethMissing
type: Class
subclass of: Oral health
definition: Specifies the participant Total number of Missing teeth
internal ID: OralNumTeethMissing

OralNumTeethFilled
type: Class
subclass of: Oral health
definition: Specifies the participant Total number of Filled teeth
internal ID: OralNumTeethFilled

OralMucosa
type: Class
subclass of: Oral health
definition: Specifies the participant Mucosa Status
internal ID: OralMucosa

TeaTempDegrees
type: Class
subclass of: Tea
definition: Specifies participant consumption of tea temperature
database_cross_reference: PATO:0001995
internal ID: TeaTempDegrees

socio-demographic and economic characteristics
type: Axiom
annotated source: TeaTempDegrees
annotated property: database_cross_reference
annotated target: PATO:0001995

TeaTempDescription
type: Class
subclass of: Tea
definition: Specifies participant used tea type
database_cross_reference: PATO:0001995
internal ID: TeaTempDescription

socio-demographic and economic characteristics
type: Axiom
annotated source: TeaTempDescription
annotated property: database_cross_reference
annotated target: PATO:0001995

TeaSteepingTime
type: Class
subclass of: Tea
definition: Specifies the duration between pouring and drinking the tea
database_cross_reference: PATO:0001995
internal ID: TeaSteepingTime

socio-demographic and economic characteristics
type: Axiom
annotated source: TeaSteepingTime
annotated property: database_cross_reference
annotated target: PATO:0001995

TeaSipOrGulp
type: Class
subclass of: Tea
definition: Specifies how participant drinks tea
database_cross_reference: PATO:0001995
internal ID: TeaSipOrGulp

socio-demographic and economic characteristics
type: Axiom
annotated source: TeaSipOrGulp
annotated property: database_cross_reference
annotated target: PATO:0001995

physactworkallyearflag
type: Class
subclass of: Physical activity
definition: Working all months of the year?
database_cross_reference: GECKO:0000104
internal ID: physactworkallyearflag

physical activity history
type: Axiom
annotated source: physactworkallyearflag
annotated property: database_cross_reference
annotated target: GECKO:0000104

physactworkmonths
type: Class
subclass of: Physical activity
definition: Number of working months in a year
database_cross_reference: GECKO:0000104
internal ID: physactworkmonths

physical activity history
type: Axiom
annotated source: physactworkmonths
annotated property: database_cross_reference
annotated target: GECKO:0000104

physactworkstrenuousflag
type: Class
subclass of: Physical activity
definition: Daily intensive physical activity?
database_cross_reference: GECKO:0000104
internal ID: physactworkstrenuousflag

physical activity history
type: Axiom
annotated source: physactworkstrenuousflag
annotated property: database_cross_reference
annotated target: GECKO:0000104

physactworkstrenuousfreq
type: Class
subclass of: Physical activity
definition: Number of working days in a week
database_cross_reference: GECKO:0000104
internal ID: physactworkstrenuousfreq

physical activity history
type: Axiom
annotated source: physactworkstrenuousfreq
annotated property: database_cross_reference
annotated target: GECKO:0000104

physactworkstrenuoushours
type: Class
subclass of: Physical activity
definition: Number of working hours in a day
database_cross_reference: GECKO:0000104
internal ID: physactworkstrenuoushours

physical activity history
type: Axiom
annotated source: physactworkstrenuoushours
annotated property: database_cross_reference
annotated target: GECKO:0000104

physactworkstrenuousyears
type: Class
subclass of: Physical activity
definition: Number of entire working years
database_cross_reference: GECKO:0000104
internal ID: physactworkstrenuousyears

physical activity history
type: Axiom
annotated source: physactworkstrenuousyears
annotated property: database_cross_reference
annotated target: GECKO:0000104

physacthouseworkflag
type: Class
subclass of: Physical activity
definition: Doing house work?
database_cross_reference: GECKO:0000104
internal ID: physacthouseworkflag

physical activity history
type: Axiom
annotated source: physacthouseworkflag
annotated property: database_cross_reference
annotated target: GECKO:0000104

physacthouseworkfreq
type: Class
subclass of: Physical activity
definition: Number of working days in a week
database_cross_reference: GECKO:0000104
internal ID: physacthouseworkfreq

physical activity history
type: Axiom
annotated source: physacthouseworkfreq
annotated property: database_cross_reference
annotated target: GECKO:0000104

physacthouseworkhours
type: Class
subclass of: Physical activity
definition: Number of working hours in a day
database_cross_reference: GECKO:0000104
internal ID: physacthouseworkhours

physical activity history
type: Axiom
annotated source: physacthouseworkhours
annotated property: database_cross_reference
annotated target: GECKO:0000104

physacthouseworkyears
type: Class
subclass of: Physical activity
definition: Number of entire working years
database_cross_reference: GECKO:0000104
internal ID: physacthouseworkyears

physical activity history
type: Axiom
annotated source: physacthouseworkyears
annotated property: database_cross_reference
annotated target: GECKO:0000104

physacthouseworkminsduringwork
type: Class
subclass of: Physical activity
definition: Doing house work: minutes during working times
database_cross_reference: GECKO:0000104
internal ID: physacthouseworkminsduringwork

physical activity history
type: Axiom
annotated source: physacthouseworkminsduringwork
annotated property: database_cross_reference
annotated target: GECKO:0000104

physacthouseworkminsnowork
type: Class
subclass of: Physical activity
definition: Doing house work: minutes during leasure times
database_cross_reference: GECKO:0000104
internal ID: physacthouseworkminsnowork

physical activity history
type: Axiom
annotated source: physacthouseworkminsnowork
annotated property: database_cross_reference
annotated target: GECKO:0000104

physactexmildminsduringwork
type: Class
subclass of: Physical activity
definition: Mild exercise such as jogging: minutes during working times
database_cross_reference: GECKO:0000104
internal ID: physactexmildminsduringwork

physical activity history
type: Axiom
annotated source: physactexmildminsduringwork
annotated property: database_cross_reference
annotated target: GECKO:0000104

physactexmildminsnowork
type: Class
subclass of: Physical activity
definition: Mild exercise such as jogging: minutes during leasure times
database_cross_reference: GECKO:0000104
internal ID: physactexmildminsnowork

physical activity history
type: Axiom
annotated source: physactexmildminsnowork
annotated property: database_cross_reference
annotated target: GECKO:0000104

physactexmodminsduringwork
type: Class
subclass of: Physical activity
definition: Moderate exercise such as volleyball: minutes during working times
database_cross_reference: GECKO:0000104
internal ID: physactexmodminsduringwork

physical activity history
type: Axiom
annotated source: physactexmodminsduringwork
annotated property: database_cross_reference
annotated target: GECKO:0000104

physactexmodminsnowork
type: Class
subclass of: Physical activity
definition: Moderate exercise such as volleyball: minutes during leasure times
database_cross_reference: GECKO:0000104
internal ID: physactexmodminsnowork

physical activity history
type: Axiom
annotated source: physactexmodminsnowork
annotated property: database_cross_reference
annotated target: GECKO:0000104

physactexstrenminsduringwork
type: Class
subclass of: Physical activity
definition: Intensive exercise such as horse riding: minutes during working times
database_cross_reference: GECKO:0000104
internal ID: physactexstrenminsduringwork

physical activity history
type: Axiom
annotated source: physactexstrenminsduringwork
annotated property: database_cross_reference
annotated target: GECKO:0000104

physactexstrenminsnowork
type: Class
subclass of: Physical activity
definition: Intensive exercise such as horse riding: minutes during leasure times
database_cross_reference: GECKO:0000104
internal ID: physactexstrenminsnowork

physical activity history
type: Axiom
annotated source: physactexstrenminsnowork
annotated property: database_cross_reference
annotated target: GECKO:0000104

physacttvminsduringwork
type: Class
subclass of: Physical activity
definition: Watching TV, resting, reading: minutes during working times
database_cross_reference: GECKO:0000104
internal ID: physacttvminsduringwork

physical activity history
type: Axiom
annotated source: physacttvminsduringwork
annotated property: database_cross_reference
annotated target: GECKO:0000104

physacttvminsnowork
type: Class
subclass of: Physical activity
definition: Watching TV, resting, reading: minutes during leasure times
database_cross_reference: GECKO:0000104
internal ID: physacttvminsnowork

physical activity history
type: Axiom
annotated source: physacttvminsnowork
annotated property: database_cross_reference
annotated target: GECKO:0000104

Metabolic Equivalent Task
type: Class
subclass of: Physical activity
definition: Energy cost of physical activities defined as the ratio of metabolic rate (and therefore the rate of energy consumption) during a specific physical activity to a reference metabolic rate
database_cross_reference: GECKO:0000104
internal ID: Metabolic_Equivalent_Task

physical activity history
type: Axiom
annotated source: Metabolic Equivalent Task
annotated property: database_cross_reference
annotated target: GECKO:0000104

AnimalStartAge_1
type: Class
subclass of: Animal contact
definition: Specifies the age of the participants he had contact with animals, first history
database_cross_reference: PATO:0001995
internal ID: AnimalStartAge_1

socio-demographic and economic characteristics
type: Axiom
annotated source: AnimalStartAge_1
annotated property: database_cross_reference
annotated target: PATO:0001995

AnimalEndAge_1
type: Class
subclass of: Animal contact
definition: Specifies the age of the participants he didn't have contact with animals, first history
database_cross_reference: PATO:0001995
internal ID: AnimalEndAge_1

socio-demographic and economic characteristics
type: Axiom
annotated source: AnimalEndAge_1
annotated property: database_cross_reference
annotated target: PATO:0001995

AnimalLevelOfContact_1
type: Class
subclass of: Animal contact
definition: The intensity of animal contact, first history
database_cross_reference: PATO:0001995
internal ID: AnimalLevelOfContact_1

socio-demographic and economic characteristics
type: Axiom
annotated source: AnimalLevelOfContact_1
annotated property: database_cross_reference
annotated target: PATO:0001995

AnimalType_1
type: Class
subclass of: Animal contact
definition: The type of animal, first history
database_cross_reference: PATO:0001995
internal ID: AnimalType_1

socio-demographic and economic characteristics
type: Axiom
annotated source: AnimalType_1
annotated property: database_cross_reference
annotated target: PATO:0001995

AnimalStartAge_2
type: Class
subclass of: Animal contact
definition: Specifies the age of the participants he had contact with animals, second history
database_cross_reference: PATO:0001995
internal ID: AnimalStartAge_2

socio-demographic and economic characteristics
type: Axiom
annotated source: AnimalStartAge_2
annotated property: database_cross_reference
annotated target: PATO:0001995

AnimalEndAge_2
type: Class
subclass of: Animal contact
definition: Specifies the age of the participants he didn't have contact with animals, second history
database_cross_reference: PATO:0001995
internal ID: AnimalEndAge_2

socio-demographic and economic characteristics
type: Axiom
annotated source: AnimalEndAge_2
annotated property: database_cross_reference
annotated target: PATO:0001995

AnimalLevelOfContact_2
type: Class
subclass of: Animal contact
definition: The intensity of animal contact, second history
database_cross_reference: PATO:0001995
internal ID: AnimalLevelOfContact_2

socio-demographic and economic characteristics
type: Axiom
annotated source: AnimalLevelOfContact_2
annotated property: database_cross_reference
annotated target: PATO:0001995

AnimalType_2
type: Class
subclass of: Animal contact
definition: The type of animal, second history
database_cross_reference: PATO:0001995
internal ID: AnimalType_2

socio-demographic and economic characteristics
type: Axiom
annotated source: AnimalType_2
annotated property: database_cross_reference
annotated target: PATO:0001995

AnimalStartAge_3
type: Class
subclass of: Animal contact
definition: Specifies the age of the participants he had contact with animals, third history
database_cross_reference: PATO:0001995
internal ID: AnimalStartAge_3

socio-demographic and economic characteristics
type: Axiom
annotated source: AnimalStartAge_3
annotated property: database_cross_reference
annotated target: PATO:0001995

AnimalEndAge_3
type: Class
subclass of: Animal contact
definition: Specifies the age of the participants he didn't have contact with animals, third history
database_cross_reference: PATO:0001995
internal ID: AnimalEndAge_3

socio-demographic and economic characteristics
type: Axiom
annotated source: AnimalEndAge_3
annotated property: database_cross_reference
annotated target: PATO:0001995

AnimalLevelOfContact_3
type: Class
subclass of: Animal contact
definition: The intensity of animal contact, third history
database_cross_reference: PATO:0001995
internal ID: AnimalLevelOfContact_3

socio-demographic and economic characteristics
type: Axiom
annotated source: AnimalLevelOfContact_3
annotated property: database_cross_reference
annotated target: PATO:0001995

AnimalType_3
type: Class
subclass of: Animal contact
definition: The type of animal, third history
database_cross_reference: PATO:0001995
internal ID: AnimalType_3

socio-demographic and economic characteristics
type: Axiom
annotated source: AnimalType_3
annotated property: database_cross_reference
annotated target: PATO:0001995

AnimalStartAge_4
type: Class
subclass of: Animal contact
definition: Specifies the age of the participants he had contact with animals, fourth history
database_cross_reference: PATO:0001995
internal ID: AnimalStartAge_4

socio-demographic and economic characteristics
type: Axiom
annotated source: AnimalStartAge_4
annotated property: database_cross_reference
annotated target: PATO:0001995

AnimalEndAge_4
type: Class
subclass of: Animal contact
definition: Specifies the age of the participants he didn't have contact with animals, fourth history
database_cross_reference: PATO:0001995
internal ID: AnimalEndAge_4

socio-demographic and economic characteristics
type: Axiom
annotated source: AnimalEndAge_4
annotated property: database_cross_reference
annotated target: PATO:0001995

AnimalLevelOfContact_4
type: Class
subclass of: Animal contact
definition: The intensity of animal contact, fourth history
database_cross_reference: PATO:0001995
internal ID: AnimalLevelOfContact_4

socio-demographic and economic characteristics
type: Axiom
annotated source: AnimalLevelOfContact_4
annotated property: database_cross_reference
annotated target: PATO:0001995

AnimalType_4
type: Class
subclass of: Animal contact
definition: The type of animal, fourth history
database_cross_reference: PATO:0001995
internal ID: AnimalType_4

socio-demographic and economic characteristics
type: Axiom
annotated source: AnimalType_4
annotated property: database_cross_reference
annotated target: PATO:0001995

bodyindicessizeage15
type: Class
subclass of: Anthropometric measurements
definition: The body size participants assume they have had based on pictogram when they were 15 years old
database_cross_reference: CMO:0000021
internal ID: bodyindicessizeage15

anthropometry
type: Axiom
annotated source: bodyindicessizeage15
annotated property: database_cross_reference
annotated target: CMO:0000021

bodyindicessizeage30
type: Class
subclass of: Anthropometric measurements
definition: The body size participants assume they have had based on pictogram when they wer3 30 years old
database_cross_reference: CMO:0000021
internal ID: bodyindicessizeage30

anthropometry
type: Axiom
annotated source: bodyindicessizeage30
annotated property: database_cross_reference
annotated target: CMO:0000021

bodyindicessizenow
type: Class
subclass of: Anthropometric measurements
definition: The body size participants assume they have at the present time based on pictogram
database_cross_reference: CMO:0000021
internal ID: bodyindicessizenow

anthropometry
type: Axiom
annotated source: bodyindicessizenow
annotated property: database_cross_reference
annotated target: CMO:0000021

bodyindicesheight
type: Class
subclass of: Anthropometric measurements
definition: Height
database_cross_reference: CMO:0000106
internal ID: bodyindicesheight

height
type: Axiom
annotated source: bodyindicesheight
annotated property: database_cross_reference
annotated target: CMO:0000106

bodyindicesweight
type: Class
subclass of: Anthropometric measurements
definition: Weight
database_cross_reference: CMO:0000012
internal ID: bodyindicesweight

weight
type: Axiom
annotated source: bodyindicesweight
annotated property: database_cross_reference
annotated target: CMO:0000012

bodyindiceswaist
type: Class
subclass of: Anthropometric measurements
definition: Waist circumference
database_cross_reference: CMO:0000021
internal ID: bodyindiceswaist

anthropometry
type: Axiom
annotated source: bodyindiceswaist
annotated property: database_cross_reference
annotated target: CMO:0000021

bodyindiceships
type: Class
subclass of: Anthropometric measurements
definition: Hip circumference
database_cross_reference: CMO:0000021
internal ID: bodyindiceships

anthropometry
type: Axiom
annotated source: bodyindiceships
annotated property: database_cross_reference
annotated target: CMO:0000021

BMI
type: Class
subclass of: Anthropometric measurements
definition: Body mass index
database_cross_reference: CMO:0000021
internal ID: BMI

anthropometry
type: Axiom
annotated source: BMI
annotated property: database_cross_reference
annotated target: CMO:0000021

bpright1sbp
type: Class
subclass of: Blood pressure measurements
definition: First measurement of systolic blood pressure from the right arm
database_cross_reference: CMO:0000003
internal ID: bpright1sbp

blood pressure
type: Axiom
annotated source: bpright1sbp
annotated property: database_cross_reference
annotated target: CMO:0000003

bpright1dbp
type: Class
subclass of: Blood pressure measurements
definition: First measurement ofdiastolic blood pressure from the right arm
database_cross_reference: CMO:0000003
internal ID: bpright1dbp

blood pressure
type: Axiom
annotated source: bpright1dbp
annotated property: database_cross_reference
annotated target: CMO:0000003

bpright2sbp
type: Class
subclass of: Blood pressure measurements
definition: Second measurement of systolic blood pressure from the right arm
database_cross_reference: CMO:0000003
internal ID: bpright2sbp

blood pressure
type: Axiom
annotated source: bpright2sbp
annotated property: database_cross_reference
annotated target: CMO:0000003

bpright2dbp
type: Class
subclass of: Blood pressure measurements
definition: Second measurement of diastolic blood pressure from the right arm
database_cross_reference: CMO:0000003
internal ID: bpright2dbp

blood pressure
type: Axiom
annotated source: bpright2dbp
annotated property: database_cross_reference
annotated target: CMO:0000003

bpleft1sbp
type: Class
subclass of: Blood pressure measurements
definition: First measurement of systolic blood pressure from the left arm
database_cross_reference: CMO:0000003
internal ID: bpleft1sbp

blood pressure
type: Axiom
annotated source: bpleft1sbp
annotated property: database_cross_reference
annotated target: CMO:0000003

bpleft1dbp
type: Class
subclass of: Blood pressure measurements
definition: First measurement of diastolic blood pressure from the left arm
database_cross_reference: CMO:0000003
internal ID: bpleft1dbp

blood pressure
type: Axiom
annotated source: bpleft1dbp
annotated property: database_cross_reference
annotated target: CMO:0000003

bpleft2sbp
type: Class
subclass of: Blood pressure measurements
definition: Second measurement of systolic blood pressure from the left arm
database_cross_reference: CMO:0000003
internal ID: bpleft2sbp

blood pressure
type: Axiom
annotated source: bpleft2sbp
annotated property: database_cross_reference
annotated target: CMO:0000003

bpleft2dbp
type: Class
subclass of: Blood pressure measurements
definition: Second measurement of diastolic blood pressure from the left arm
database_cross_reference: CMO:0000003
internal ID: bpleft2dbp

blood pressure
type: Axiom
annotated source: bpleft2dbp
annotated property: database_cross_reference
annotated target: CMO:0000003

m_sbp
type: Class
subclass of: Blood pressure measurements
definition: Mean systolic blood pressure measured second time
database_cross_reference: CMO:0000003
internal ID: m_sbp

blood pressure
type: Axiom
annotated source: m_sbp
annotated property: database_cross_reference
annotated target: CMO:0000003

m_dbp
type: Class
subclass of: Blood pressure measurements
definition: Mean diastolic blood pressure measured second time
database_cross_reference: CMO:0000003
internal ID: m_dbp

blood pressure
type: Axiom
annotated source: m_dbp
annotated property: database_cross_reference
annotated target: CMO:0000003

high_sbp
type: Class
subclass of: Blood pressure measurements
definition: Systolic blood pressure >= 140 mmHg
database_cross_reference: OGMS:0000020
internal ID: high_sbp

signs and symptoms
type: Axiom
annotated source: high_sbp
annotated property: database_cross_reference
annotated target: OGMS:0000020

high_dbp
type: Class
subclass of: Blood pressure measurements
definition: Diastolic blood pressure >= 90 mmHg
database_cross_reference: OGMS:0000020
internal ID: high_dbp

signs and symptoms
type: Axiom
annotated source: high_dbp
annotated property: database_cross_reference
annotated target: OGMS:0000020

htndrug
type: Class
subclass of: Blood pressure measurements
definition: Consumption of any anti-hypertensive medication for more than 6 months
database_cross_reference: PDRO:0000024
internal ID: htndrug

prescription
type: Axiom
annotated source: htndrug
annotated property: database_cross_reference
annotated target: PDRO:0000024

HTN
type: Class
subclass of: Blood pressure measurements
definition: Being hypertensive
database_cross_reference: MONDO:0004995
internal ID: HTN

cardiovascular diseases
type: Axiom
annotated source: HTN
annotated property: database_cross_reference
annotated target: MONDO:0004995

HTNcat
type: Class
subclass of: Blood pressure measurements
definition: Categorization of hypetrension
database_cross_reference: MONDO:0004995
internal ID: HTNcat

cardiovascular diseases
type: Axiom
annotated source: HTNcat
annotated property: database_cross_reference
annotated target: MONDO:0004995

preHTN
type: Class
subclass of: Blood pressure measurements
definition: SBP/DBP >=120/80 AND <140/90
database_cross_reference: MONDO:0004995
internal ID: preHTN

cardiovascular diseases
type: Axiom
annotated source: preHTN
annotated property: database_cross_reference
annotated target: MONDO:0004995

pulse_p
type: Class
subclass of: Blood pressure measurements
definition: Difference between SBP and DBP
database_cross_reference: CMO:0000294
internal ID: pulse_p

heart rate (HR)
type: Axiom
annotated source: pulse_p
annotated property: database_cross_reference
annotated target: CMO:0000294

mean_bp
type: Class
subclass of: Blood pressure measurements
definition: mean value of SBP and DBP
database_cross_reference: CMO:0000003
internal ID: mean_bp

blood pressure
type: Axiom
annotated source: mean_bp
annotated property: database_cross_reference
annotated target: CMO:0000003

mid_bp
type: Class
subclass of: Blood pressure measurements
definition: Mid value of SBP and DBP
database_cross_reference: CMO:0000003
internal ID: mid_bp

blood pressure
type: Axiom
annotated source: mid_bp
annotated property: database_cross_reference
annotated target: CMO:0000003

diffsbp_right_left
type: Class
subclass of: Blood pressure measurements
definition: Difference in SBP between arms
database_cross_reference: CMO:0000003
internal ID: diffsbp_right_left

blood pressure
type: Axiom
annotated source: diffsbp_right_left
annotated property: database_cross_reference
annotated target: CMO:0000003

diffdbp_right_left
type: Class
subclass of: Blood pressure measurements
definition: Difference in DBP between arms
database_cross_reference: CMO:0000003
internal ID: diffdbp_right_left

blood pressure
type: Axiom
annotated source: diffdbp_right_left
annotated property: database_cross_reference
annotated target: CMO:0000003

Energy
type: Class
subclass of: Food Frequency Questionnaire
definition: Amount consumed per day
database_cross_reference: GECKO:0000072
internal ID: Energy

dietary history
type: Axiom
annotated source: Energy
annotated property: database_cross_reference
annotated target: GECKO:0000072

fat
type: Class
subclass of: Food Frequency Questionnaire
definition: Amount consumed per day
database_cross_reference: GECKO:0000072
internal ID: fat

dietary history
type: Axiom
annotated source: fat
annotated property: database_cross_reference
annotated target: GECKO:0000072

salt
type: Class
subclass of: Food Frequency Questionnaire
definition: Amount consumed per day
database_cross_reference: GECKO:0000072
internal ID: salt

dietary history
type: Axiom
annotated source: salt
annotated property: database_cross_reference
annotated target: GECKO:0000072

protein
type: Class
subclass of: Food Frequency Questionnaire
definition: Amount consumed per day
database_cross_reference: GECKO:0000072
internal ID: protein

dietary history
type: Axiom
annotated source: protein
annotated property: database_cross_reference
annotated target: GECKO:0000072

total saturated fat
type: Class
subclass of: Food Frequency Questionnaire
definition: Amount consumed per day
database_cross_reference: GECKO:0000072
internal ID: total_saturated_fat

dietary history
type: Axiom
annotated source: total saturated fat
annotated property: database_cross_reference
annotated target: GECKO:0000072

total trans fat
type: Class
subclass of: Food Frequency Questionnaire
definition: Amount consumed per day
database_cross_reference: GECKO:0000072
internal ID: total_trans_fat

dietary history
type: Axiom
annotated source: total trans fat
annotated property: database_cross_reference
annotated target: GECKO:0000072

hydrogenated oil
type: Class
subclass of: Food Frequency Questionnaire
definition: Amount consumed per day
database_cross_reference: GECKO:0000072
internal ID: hydrogenated_oil

dietary history
type: Axiom
annotated source: hydrogenated oil
annotated property: database_cross_reference
annotated target: GECKO:0000072

carbohyderate
type: Class
subclass of: Food Frequency Questionnaire
definition: Amount consumed per day
database_cross_reference: GECKO:0000072
internal ID: carbohyderate

dietary history
type: Axiom
annotated source: carbohyderate
annotated property: database_cross_reference
annotated target: GECKO:0000072

red meat
type: Class
subclass of: Food Frequency Questionnaire
definition: Amount consumed per day
database_cross_reference: GECKO:0000072
internal ID: red_meat

dietary history
type: Axiom
annotated source: red meat
annotated property: database_cross_reference
annotated target: GECKO:0000072

processed meat
type: Class
subclass of: Food Frequency Questionnaire
definition: Amount consumed per day
database_cross_reference: GECKO:0000072
internal ID: processed_meat

dietary history
type: Axiom
annotated source: processed meat
annotated property: database_cross_reference
annotated target: GECKO:0000072

fruits
type: Class
subclass of: Food Frequency Questionnaire
definition: Amount consumed per day
database_cross_reference: GECKO:0000072
internal ID: fruits

dietary history
type: Axiom
annotated source: fruits
annotated property: database_cross_reference
annotated target: GECKO:0000072

vegetables
type: Class
subclass of: Food Frequency Questionnaire
definition: Amount consumed per day
database_cross_reference: GECKO:0000072
internal ID: vegetables

dietary history
type: Axiom
annotated source: vegetables
annotated property: database_cross_reference
annotated target: GECKO:0000072

dairy products
type: Class
subclass of: Food Frequency Questionnaire
definition: Amount consumed per day
database_cross_reference: GECKO:0000072
internal ID: dairy_products

dietary history
type: Axiom
annotated source: dairy products
annotated property: database_cross_reference
annotated target: GECKO:0000072

milk
type: Class
subclass of: Food Frequency Questionnaire
definition: Amount consumed per day
database_cross_reference: GECKO:0000072
internal ID: milk

dietary history
type: Axiom
annotated source: milk
annotated property: database_cross_reference
annotated target: GECKO:0000072

dietary fiber
type: Class
subclass of: Food Frequency Questionnaire
definition: Amount consumed per day
database_cross_reference: GECKO:0000072
internal ID: dietary_fiber

dietary history
type: Axiom
annotated source: dietary fiber
annotated property: database_cross_reference
annotated target: GECKO:0000072

Fish
type: Class
subclass of: Food Frequency Questionnaire
definition: Amount consumed per day
database_cross_reference: GECKO:0000072
internal ID: Fish

dietary history
type: Axiom
annotated source: Fish
annotated property: database_cross_reference
annotated target: GECKO:0000072

Chicken
type: Class
subclass of: Food Frequency Questionnaire
definition: Amount consumed per day
database_cross_reference: GECKO:0000072
internal ID: Chicken

dietary history
type: Axiom
annotated source: Chicken
annotated property: database_cross_reference
annotated target: GECKO:0000072

SodiumNa
type: Class
subclass of: Food Frequency Questionnaire
definition: Amount consumed per day
database_cross_reference: GECKO:0000072
internal ID: SodiumNa

dietary history
type: Axiom
annotated source: SodiumNa
annotated property: database_cross_reference
annotated target: GECKO:0000072

Calcium
type: Class
subclass of: Food Frequency Questionnaire
definition: Amount consumed per day
database_cross_reference: GECKO:0000072
internal ID: Calcium

dietary history
type: Axiom
annotated source: Calcium
annotated property: database_cross_reference
annotated target: GECKO:0000072

Fe
type: Class
subclass of: Food Frequency Questionnaire
definition: Amount consumed per day
database_cross_reference: GECKO:0000072
internal ID: Fe

dietary history
type: Axiom
annotated source: Fe
annotated property: database_cross_reference
annotated target: GECKO:0000072

Magnesium
type: Class
subclass of: Food Frequency Questionnaire
definition: Amount consumed per day
database_cross_reference: GECKO:0000072
internal ID: Magnesium

dietary history
type: Axiom
annotated source: Magnesium
annotated property: database_cross_reference
annotated target: GECKO:0000072

Phosphorus
type: Class
subclass of: Food Frequency Questionnaire
definition: Amount consumed per day
database_cross_reference: GECKO:0000072
internal ID: Phosphorus

dietary history
type: Axiom
annotated source: Phosphorus
annotated property: database_cross_reference
annotated target: GECKO:0000072

Potassium
type: Class
subclass of: Food Frequency Questionnaire
definition: Amount consumed per day
database_cross_reference: GECKO:0000072
internal ID: Potassium

dietary history
type: Axiom
annotated source: Potassium
annotated property: database_cross_reference
annotated target: GECKO:0000072

Zinc
type: Class
subclass of: Food Frequency Questionnaire
definition: Amount consumed per day
database_cross_reference: GECKO:0000072
internal ID: Zinc

dietary history
type: Axiom
annotated source: Zinc
annotated property: database_cross_reference
annotated target: GECKO:0000072

Folate
type: Class
subclass of: Food Frequency Questionnaire
definition: Amount consumed per day
database_cross_reference: GECKO:0000072
internal ID: Folate

dietary history
type: Axiom
annotated source: Folate
annotated property: database_cross_reference
annotated target: GECKO:0000072

Vitamin D
type: Class
subclass of: Food Frequency Questionnaire
definition: Amount consumed per day
database_cross_reference: GECKO:0000072
internal ID: Vitamin_D

dietary history
type: Axiom
annotated source: Vitamin D
annotated property: database_cross_reference
annotated target: GECKO:0000072

Vitamin A
type: Class
subclass of: Food Frequency Questionnaire
definition: Amount consumed per day
database_cross_reference: GECKO:0000072
internal ID: Vitamin_A

dietary history
type: Axiom
annotated source: Vitamin A
annotated property: database_cross_reference
annotated target: GECKO:0000072

Vitamin B1
type: Class
subclass of: Food Frequency Questionnaire
definition: Amount consumed per day
database_cross_reference: GECKO:0000072
internal ID: Vitamin_B1

dietary history
type: Axiom
annotated source: Vitamin B1
annotated property: database_cross_reference
annotated target: GECKO:0000072

Vitamin B2
type: Class
subclass of: Food Frequency Questionnaire
definition: Amount consumed per day
database_cross_reference: GECKO:0000072
internal ID: Vitamin_B2

dietary history
type: Axiom
annotated source: Vitamin B2
annotated property: database_cross_reference
annotated target: GECKO:0000072

Vitamin B12
type: Class
subclass of: Food Frequency Questionnaire
definition: Amount consumed per day
database_cross_reference: GECKO:0000072
internal ID: Vitamin_B12

dietary history
type: Axiom
annotated source: Vitamin B12
annotated property: database_cross_reference
annotated target: GECKO:0000072

Vitamin C
type: Class
subclass of: Food Frequency Questionnaire
definition: Amount consumed per day
database_cross_reference: GECKO:0000072
internal ID: Vitamin_C

dietary history
type: Axiom
annotated source: Vitamin C
annotated property: database_cross_reference
annotated target: GECKO:0000072

Niacin
type: Class
subclass of: Food Frequency Questionnaire
definition: Amount consumed per day
database_cross_reference: GECKO:0000072
internal ID: Niacin

dietary history
type: Axiom
annotated source: Niacin
annotated property: database_cross_reference
annotated target: GECKO:0000072

Glycemic load
type: Class
subclass of: Food Frequency Questionnaire
definition: Amount consumed per day
database_cross_reference: GECKO:0000072
internal ID: Glycemic_load

dietary history
type: Axiom
annotated source: Glycemic load
annotated property: database_cross_reference
annotated target: GECKO:0000072

Glycemic Index
type: Class
subclass of: Food Frequency Questionnaire
definition: Amount consumed per day
database_cross_reference: GECKO:0000072
internal ID: Glycemic_Index

dietary history
type: Axiom
annotated source: Glycemic Index
annotated property: database_cross_reference
annotated target: GECKO:0000072

Sugar intake
type: Class
subclass of: Food Frequency Questionnaire
definition: Amount consumed per day
database_cross_reference: GECKO:0000072
internal ID: Sugar_intake

dietary history
type: Axiom
annotated source: Sugar intake
annotated property: database_cross_reference
annotated target: GECKO:0000072

Nuts
type: Class
subclass of: Food Frequency Questionnaire
definition: Amount consumed per day
database_cross_reference: GECKO:0000072
internal ID: Nuts

dietary history
type: Axiom
annotated source: Nuts
annotated property: database_cross_reference
annotated target: GECKO:0000072

tea
type: Class
subclass of: Food Frequency Questionnaire
definition: Amount consumed per day
database_cross_reference: GECKO:0000072
internal ID: tea

dietary history
type: Axiom
annotated source: tea
annotated property: database_cross_reference
annotated target: GECKO:0000072

Coffee
type: Class
subclass of: Food Frequency Questionnaire
definition: Amount consumed per day
database_cross_reference: GECKO:0000072
internal ID: Coffee

dietary history
type: Axiom
annotated source: Coffee
annotated property: database_cross_reference
annotated target: GECKO:0000072

fbg
type: Class
subclass of: Lab markers
definition: Fasting Blood Glucose
database_cross_reference: UBERON:0000178
internal ID: fbg

blood
type: Axiom
annotated source: fbg
annotated property: database_cross_reference
annotated target: UBERON:0000178

urea
type: Class
subclass of: Lab markers
definition: Urea
database_cross_reference: UBERON:0000178
internal ID: urea

blood
type: Axiom
annotated source: urea
annotated property: database_cross_reference
annotated target: UBERON:0000178

creatinine
type: Class
subclass of: Lab markers
definition: Creatinine
database_cross_reference: UBERON:0000178
internal ID: creatinine

blood
type: Axiom
annotated source: creatinine
annotated property: database_cross_reference
annotated target: UBERON:0000178

cholesterol
type: Class
subclass of: Lab markers
definition: Total Cholesterol
database_cross_reference: UBERON:0000178
internal ID: cholesterol

blood
type: Axiom
annotated source: cholesterol
annotated property: database_cross_reference
annotated target: UBERON:0000178

triglycerides
type: Class
subclass of: Lab markers
definition: Triglycerides
database_cross_reference: UBERON:0000178
internal ID: triglycerides

blood
type: Axiom
annotated source: triglycerides
annotated property: database_cross_reference
annotated target: UBERON:0000178

hdl
type: Class
subclass of: Lab markers
definition: High Density Lipoprotein
database_cross_reference: UBERON:0000178
internal ID: hdl

blood
type: Axiom
annotated source: hdl
annotated property: database_cross_reference
annotated target: UBERON:0000178

ast
type: Class
subclass of: Lab markers
definition: Aspartate Transaminase
database_cross_reference: UBERON:0000178
internal ID: ast

blood
type: Axiom
annotated source: ast
annotated property: database_cross_reference
annotated target: UBERON:0000178

alt
type: Class
subclass of: Lab markers
definition: Alanine Transaminase
database_cross_reference: UBERON:0000178
internal ID: alt

blood
type: Axiom
annotated source: alt
annotated property: database_cross_reference
annotated target: UBERON:0000178

alkalinep
type: Class
subclass of: Lab markers
definition: Alkaline Phosphatase
database_cross_reference: UBERON:0000178
internal ID: alkalinep

blood
type: Axiom
annotated source: alkalinep
annotated property: database_cross_reference
annotated target: UBERON:0000178

ldl
type: Class
subclass of: Lab markers
definition: Low Density Lipoprotein
database_cross_reference: UBERON:0000178
internal ID: ldl

blood
type: Axiom
annotated source: ldl
annotated property: database_cross_reference
annotated target: UBERON:0000178

ldlhdl
type: Class
subclass of: Lab markers
definition: LDL to HDL ratio
database_cross_reference: UBERON:0000178
internal ID: ldlhdl

blood
type: Axiom
annotated source: ldlhdl
annotated property: database_cross_reference
annotated target: UBERON:0000178

gamma
type: Class
subclass of: Lab markers
definition: Gamma Glutamyle Transpeptidase
database_cross_reference: UBERON:0000178
internal ID: gamma

blood
type: Axiom
annotated source: gamma
annotated property: database_cross_reference
annotated target: UBERON:0000178

hbsag
type: Class
subclass of: Lab markers
definition: HBsAg
database_cross_reference: UBERON:0000178
internal ID: hbsag

blood
type: Axiom
annotated source: hbsag
annotated property: database_cross_reference
annotated target: UBERON:0000178

hbsab
type: Class
subclass of: Lab markers
definition: HBsAb
database_cross_reference: UBERON:0000178
internal ID: hbsab

blood
type: Axiom
annotated source: hbsab
annotated property: database_cross_reference
annotated target: UBERON:0000178

hbcab
type: Class
subclass of: Lab markers
definition: HBcAb
database_cross_reference: UBERON:0000178
internal ID: hbcab

blood
type: Axiom
annotated source: hbcab
annotated property: database_cross_reference
annotated target: UBERON:0000178

hbv
type: Class
subclass of: Lab markers
definition: HBV DNA
database_cross_reference: UBERON:0000178
internal ID: hbv

blood
type: Axiom
annotated source: hbv
annotated property: database_cross_reference
annotated target: UBERON:0000178

hcv
type: Class
subclass of: Lab markers
definition: HCV Antibody
database_cross_reference: UBERON:0000178
internal ID: hcv

blood
type: Axiom
annotated source: hcv
annotated property: database_cross_reference
annotated target: UBERON:0000178

wbc
type: Class
subclass of: Lab markers
definition: White Blood Cell
database_cross_reference: UBERON:0000178
internal ID: wbc

blood
type: Axiom
annotated source: wbc
annotated property: database_cross_reference
annotated target: UBERON:0000178

rbc
type: Class
subclass of: Lab markers
definition: Red Blood Cell
database_cross_reference: UBERON:0000178
internal ID: rbc

blood
type: Axiom
annotated source: rbc
annotated property: database_cross_reference
annotated target: UBERON:0000178

hb
type: Class
subclass of: Lab markers
definition: Hemoglobin
database_cross_reference: UBERON:0000178
internal ID: hb

blood
type: Axiom
annotated source: hb
annotated property: database_cross_reference
annotated target: UBERON:0000178

hct
type: Class
subclass of: Lab markers
definition: Hematocrit
database_cross_reference: UBERON:0000178
internal ID: hct

blood
type: Axiom
annotated source: hct
annotated property: database_cross_reference
annotated target: UBERON:0000178

plt
type: Class
subclass of: Lab markers
definition: Platelet
database_cross_reference: UBERON:0000178
internal ID: plt

blood
type: Axiom
annotated source: plt
annotated property: database_cross_reference
annotated target: UBERON:0000178

mcv
type: Class
subclass of: Lab markers
definition: Mean Corpuscular Volume
database_cross_reference: UBERON:0000178
internal ID: mcv

blood
type: Axiom
annotated source: mcv
annotated property: database_cross_reference
annotated target: UBERON:0000178

mch
type: Class
subclass of: Lab markers
definition: Mean Corpuscular Hemoglobin
database_cross_reference: UBERON:0000178
internal ID: mch

blood
type: Axiom
annotated source: mch
annotated property: database_cross_reference
annotated target: UBERON:0000178

mchc
type: Class
subclass of: Lab markers
definition: Mean Corpuscular Hemoglobin Concentration
database_cross_reference: UBERON:0000178
internal ID: mchc

blood
type: Axiom
annotated source: mchc
annotated property: database_cross_reference
annotated target: UBERON:0000178

rdw
type: Class
subclass of: Lab markers
definition: Red Cell Distribution Width
database_cross_reference: UBERON:0000178
internal ID: rdw

blood
type: Axiom
annotated source: rdw
annotated property: database_cross_reference
annotated target: UBERON:0000178

BloodType
type: Class
subclass of: Lab markers
definition: Specifies patient Blood Group
database_cross_reference: UBERON:0000178
internal ID: BloodType

blood
type: Axiom
annotated source: BloodType
annotated property: database_cross_reference
annotated target: UBERON:0000178

Rh
type: Class
subclass of: Lab markers
definition: Specifies patient Blood Rh
database_cross_reference: UBERON:0000178
internal ID: Rh

blood
type: Axiom
annotated source: Rh
annotated property: database_cross_reference
annotated target: UBERON:0000178

BioSampHairAvailFlag
type: Class
subclass of: Lab markers
definition: if patient has hair sample select YES if not Selct No
database_cross_reference: GECKO:0000112
internal ID: BioSampHairAvailFlag

other biosample type
type: Axiom
annotated source: BioSampHairAvailFlag
annotated property: database_cross_reference
annotated target: GECKO:0000112

BioSampNailAvailFlag
type: Class
subclass of: Lab markers
definition: if patient has nail sample select YES if not Selct No
database_cross_reference: GECKO:0000112
internal ID: BioSampNailAvailFlag

other biosample type
type: Axiom
annotated source: BioSampNailAvailFlag
annotated property: database_cross_reference
annotated target: GECKO:0000112

BioSampBloodAvailFlag
type: Class
subclass of: Lab markers
definition: if patient has Blood sample select YES if not Selct No
database_cross_reference: UBERON:0000178
internal ID: BioSampBloodAvailFlag

blood
type: Axiom
annotated source: BioSampBloodAvailFlag
annotated property: database_cross_reference
annotated target: UBERON:0000178